<svg xmlns="http://www.w3.org/2000/svg" xmlns:xlink="http://www.w3.org/1999/xlink" width="773" height="97" viewBox="0 0 773 97">
  <defs>
    <polygon id="a" points=".11 .167 96.943 .167 96.943 97 .11 97"/>
    <polygon id="c" points=".057 .377 93.091 .377 93.091 92.89 .057 92.89"/>
  </defs>
  <g fill="none" fill-rule="evenodd" transform="translate(0.000000, -1.000000)">
    <path fill="#000000" d="M79.3001 3.2105L9.5321 3.2105C4.2761 3.2105.0001 7.4865.0001 12.7435.0001 17.9995 4.2761 22.2755 9.5321 22.2755L31.4551 22.2755C33.3451 22.2755 34.8831 23.8145 34.8831 25.7045L34.8831 86.1905C34.8831 91.4475 39.1601 95.7235 44.4161 95.7235 49.6731 95.7235 53.9491 91.4475 53.9491 86.1905L53.9491 25.7045C53.9491 23.8145 55.4871 22.2755 57.3781 22.2755L79.3001 22.2755C84.5561 22.2755 88.8331 17.9995 88.8331 12.7435 88.8331 7.4865 84.5561 3.2105 79.3001 3.2105M176.9163 3.2105C171.6603 3.2105 167.3833 7.4865 167.3833 12.7435L167.3833 36.5055C167.3833 38.3965 165.8453 39.9345 163.9553 39.9345L118.9473 39.9345C117.0573 39.9345 115.5193 38.3965 115.5193 36.5055L115.5193 12.7435C115.5193 7.4865 111.2423 3.2105 105.9863 3.2105 100.7293 3.2105 96.4533 7.4865 96.4533 12.7435L96.4533 86.1905C96.4533 91.4475 100.7293 95.7235 105.9863 95.7235 111.2423 95.7235 115.5193 91.4475 115.5193 86.1905L115.5193 62.4275C115.5193 60.5375 117.0573 59.0005 118.9473 59.0005L163.9553 59.0005C165.8453 59.0005 167.3833 60.5375 167.3833 62.4275L167.3833 86.1905C167.3833 91.4475 171.6603 95.7235 176.9163 95.7235 182.1723 95.7235 186.4493 91.4475 186.4493 86.1905L186.4493 12.7435C186.4493 7.4865 182.1723 3.2105 176.9163 3.2105"/>
    <g transform="translate(480.000000, 0.833200)">
      <mask id="b" fill="white">
        <use xlink:href="#a"/>
      </mask>
      <path fill="#000000" d="M77.8782,48.5833 C77.8782,64.7673 64.7112,77.9343 48.5272,77.9343 C32.3432,77.9343 19.1762,64.7673 19.1762,48.5833 C19.1762,32.3993 32.3432,19.2323 48.5272,19.2323 C64.7112,19.2323 77.8782,32.3993 77.8782,48.5833 M48.5272,0.1663 C35.5952,0.1663 23.4362,5.2033 14.2912,14.3473 C5.1472,23.4923 0.1102,35.6503 0.1102,48.5833 C0.1102,61.5153 5.1472,73.6743 14.2912,82.8193 C23.4362,91.9633 35.5952,97.0003 48.5272,97.0003 C61.4602,97.0003 73.6182,91.9633 82.7632,82.8193 C91.9072,73.6743 96.9432,61.5153 96.9432,48.5833 C96.9432,35.6503 91.9072,23.4923 82.7632,14.3473 C73.6182,5.2033 61.4602,0.1663 48.5272,0.1663" mask="url(#b)"/>
    </g>
    <path fill="#000000" d="M472.6067 4.1343L472.5167 4.0903C469.6167 2.8123 466.5297 2.8443 463.8267 4.1793 461.2057 5.4743 459.3047 7.8523 458.6147 10.6963L442.7037 74.4703C442.6687 74.5943 441.9547 77.0253 440.1627 77.0253 438.3767 77.0253 437.6447 74.5513 437.6207 74.4653L423.0827 18.0353C422.9707 17.5733 422.0297 13.9723 419.0277 10.3323 416.1707 6.8693 410.8677 2.7423 401.8187 2.7423 392.7697 2.7423 387.4657 6.8693 384.6097 10.3323 381.5827 14.0023 380.6297 17.7233 380.5567 18.0273L366.0077 74.5013 366.0007 74.5293C365.9767 74.6313 365.3797 77.0253 363.4747 77.0253 361.8827 77.0253 361.4357 76.0253 360.9787 74.6123 360.9627 74.5663 360.9487 74.5213 360.9347 74.4773L345.0237 10.7043C344.3317 7.8523 342.4317 5.4743 339.8117 4.1803 337.1087 2.8443 334.0227 2.8123 331.1227 4.0893L331.0317 4.1333C326.8357 6.3793 324.7467 10.8933 325.8357 15.3733L342.1477 80.7993C342.1867 80.9593 343.1387 84.7693 346.2397 88.5083 349.1107 91.9673 354.4307 96.0913 363.4747 96.0913 372.5237 96.0913 377.8277 91.9643 380.6837 88.5013 383.7097 84.8323 384.6627 81.1123 384.7367 80.8053L399.2817 24.3473 399.2857 24.3323C399.3107 24.2293 399.9417 21.8073 401.8187 21.8073 403.6857 21.8073 404.3287 24.2413 404.3527 24.3383L418.8977 80.7963C419.0067 81.2513 419.9477 84.8553 422.9537 88.5013 425.8097 91.9643 431.1137 96.0913 440.1627 96.0913 449.2067 96.0913 454.5267 91.9673 457.3977 88.5083 460.4457 84.8343 461.3917 81.2013 461.4887 80.8053L477.8037 15.3653C478.8897 10.8943 476.8007 6.3813 472.6067 4.1343M219.0169 22.2759L264.3349 22.2759C266.8639 22.2759 269.2609 21.3139 271.0849 19.5659 272.9269 17.8009 273.9669 15.4399 274.0129 12.9179 274.0589 10.3409 273.0889 7.9079 271.2799 6.0669 269.4709 4.2249 267.0569 3.2109 264.4809 3.2109L206.0559 3.2109C200.7949 3.2109 196.5149 7.4909 196.5149 12.7519L196.5149 86.1829C196.5149 91.4429 200.7949 95.7239 206.0559 95.7239L264.3349 95.7239C266.8639 95.7239 269.2609 94.7609 271.0849 93.0139 272.9269 91.2479 273.9669 88.8869 274.0129 86.3649 274.0589 83.7879 273.0889 81.3559 271.2799 79.5139 269.4709 77.6719 267.0569 76.6579 264.4809 76.6579L219.0169 76.6579C217.1219 76.6579 215.5799 75.1159 215.5799 73.2219L215.5799 62.4369C215.5799 60.5409 217.1219 58.9999 219.0169 58.9999L260.1699 58.9999C262.6979 58.9999 265.0949 58.0369 266.9189 56.2899 268.7619 54.5249 269.8019 52.1639 269.8469 49.6419 269.8929 47.0649 268.9229 44.6319 267.1149 42.7909 265.3059 40.9489 262.8919 39.9339 260.3159 39.9339L219.0169 39.9339C217.1219 39.9339 215.5799 38.3929 215.5799 36.4979L215.5799 25.7129C215.5799 23.8179 217.1219 22.2759 219.0169 22.2759M649.1692 31.105C649.1692 35.974 645.2082 39.934 640.3402 39.934L608.6902 39.934C606.8012 39.934 605.2632 38.396 605.2632 36.506L605.2632 25.726C605.2642 23.825 606.8102 22.277 608.7092 22.276L640.3402 22.276C645.2082 22.276 649.1692 26.237 649.1692 31.105L649.1692 31.105zM667.0842 81.888L651.5622 56.639C655.8412 54.753 659.5792 51.831 662.4422 48.119 666.2312 43.206 668.2342 37.323 668.2342 31.105 668.2342 15.724 655.7212 3.21 640.3382 3.21L640.3022 3.21 634.0802 3.21 595.7302 3.21C590.4742 3.21 586.1972 7.487 586.1972 12.743L586.1972 86.19C586.1972 91.447 590.4742 95.724 595.7312 95.724 600.9862 95.724 605.2632 91.447 605.2632 86.19L605.2632 62.428C605.2632 60.538 606.8012 59 608.6912 59L620.1552 59 620.2682 59C624.9702 59 632.0012 59.065 636.6142 67.451L636.6282 67.474 650.6402 90.68C652.2132 93.573 655.1642 95.48 658.3492 95.657 658.5302 95.668 658.7142 95.673 658.8962 95.673 662.0942 95.673 665.0302 94.065 666.7512 91.373 668.5902 88.495 668.7312 84.979 667.1252 81.965L667.0842 81.888z"/>
    <g transform="translate(679.000000, 2.833200)">
      <mask id="d" fill="white">
        <use xlink:href="#c"/>
      </mask>
      <path fill="#000000" d="M19.1223,22.8934 C19.1223,20.9924 20.6683,19.4444 22.5673,19.4424 L46.8353,19.4424 C54.0983,19.4424 60.9263,22.2714 66.0613,27.4074 C71.1973,32.5424 74.0253,39.3714 74.0253,46.6334 C74.0253,53.8964 71.1973,60.7244 66.0613,65.8604 C60.9263,70.9964 54.0983,73.8254 46.8353,73.8254 L22.5683,73.8254 C20.7063,73.8254 19.1623,72.3134 19.1203,70.4534 L19.1223,22.8934 Z M89.4553,28.6284 C87.1263,23.1204 83.7913,18.1734 79.5433,13.9254 C75.2953,9.6784 70.3493,6.3424 64.8403,4.0134 C59.1373,1.6004 53.0793,0.3774 46.8353,0.3774 L9.5893,0.3774 C4.3323,0.3774 0.0573,4.6534 0.0573,9.9094 L0.0573,83.3584 C0.0573,88.6144 4.3323,92.8904 9.5893,92.8904 L46.8353,92.8904 C53.0793,92.8904 59.1373,91.6664 64.8403,89.2544 C70.3493,86.9244 75.2953,83.5894 79.5433,79.3414 C83.7913,75.0944 87.1263,70.1474 89.4553,64.6394 C91.8683,58.9354 93.0913,52.8774 93.0913,46.6334 C93.0913,40.3904 91.8683,34.3314 89.4553,28.6284 L89.4553,28.6284 Z" mask="url(#d)"/>
    </g>
  </g>
</svg>
