<?xml version="1.0" encoding="UTF-8"?>
<svg width="25px" height="25px" viewBox="0 0 25 25" version="1.1" xmlns="http://www.w3.org/2000/svg" xmlns:xlink="http://www.w3.org/1999/xlink">
    <!-- Generator: Sketch 47.1 (45422) - http://www.bohemiancoding.com/sketch -->
    <title>icon-instagram</title>
    <desc>Created with Sketch.</desc>
    <defs></defs>
    <g id="stuff" stroke="none" stroke-width="1" fill="none" fill-rule="evenodd">
        <g id="icon-instagram">
            <path d="M16.3390625,7.87538462 L8.740625,7.87538462 C8.165625,7.87538462 7.7,8.33423077 7.7,8.90038462 L7.7,16.3819231 C7.7,16.9476923 8.165625,17.4065385 8.740625,17.4065385 L16.3390625,17.4065385 C16.9140625,17.4065385 17.3800781,16.9476923 17.3800781,16.3819231 L17.3800781,8.90038462 C17.3800781,8.33423077 16.9140625,7.87538462 16.3390625,7.87538462 L16.3390625,7.87538462 Z M10.7824219,11.7246154 C10.8230469,11.6476923 10.8691406,11.5734615 10.9195312,11.5026923 C10.9210937,11.5011538 10.921875,11.4992308 10.9234375,11.4976923 C10.9601562,11.4469231 10.9988281,11.3980769 11.0402344,11.3511538 C11.0425781,11.3480769 11.0453125,11.345 11.0480469,11.3419231 C11.0878906,11.2973077 11.1292969,11.2538462 11.1734375,11.2126923 C11.1773437,11.2088462 11.1820312,11.2046154 11.1867187,11.2003846 C11.2,11.1880769 11.2136719,11.1757692 11.2277344,11.1638462 C11.2324219,11.1592308 11.2382812,11.1546154 11.2429687,11.1503846 C11.2675781,11.1296154 11.2921875,11.1096154 11.3171875,11.0903846 C11.3238281,11.0846154 11.3308594,11.0796154 11.3375,11.0742308 C11.3507812,11.0646154 11.3640625,11.055 11.3773437,11.0453846 C11.3859375,11.0392308 11.3953125,11.0326923 11.4042969,11.0265385 C11.4207031,11.015 11.4371094,11.0038462 11.4535156,10.9934615 C11.4691406,10.9830769 11.4847656,10.9730769 11.5007812,10.9634615 C11.5128906,10.9561538 11.5246094,10.9496154 11.5367187,10.9426923 C11.5488281,10.9357692 11.5613281,10.9284615 11.5738281,10.9219231 C11.5851562,10.915 11.596875,10.9088462 11.6085937,10.9026923 C11.6296875,10.8911538 11.6519531,10.88 11.6742187,10.8696154 C11.6835937,10.865 11.6933594,10.8603846 11.703125,10.8565385 C11.7191406,10.8488462 11.7355469,10.8415385 11.7519531,10.8346154 C11.7625,10.83 11.7726562,10.8257692 11.7832031,10.8211538 C11.8039062,10.8130769 11.8238281,10.8053846 11.8441406,10.7976923 C11.8527344,10.7946154 11.8609375,10.7915385 11.8695312,10.7884615 C11.8921875,10.7803846 11.9152344,10.7726923 11.9386719,10.7657692 C11.9476562,10.7626923 11.9570312,10.76 11.9664062,10.7569231 C11.9875,10.7507692 12.0082031,10.745 12.0289062,10.7396154 C12.0363281,10.7376923 12.0429687,10.7357692 12.0503906,10.7338462 C12.0773437,10.7273077 12.1046875,10.7211538 12.1328125,10.715 C12.1402344,10.7134615 12.1484375,10.7123077 12.15625,10.7107692 C12.1785156,10.7061538 12.2003906,10.7023077 12.2234375,10.6988462 C12.23125,10.6976923 12.2386719,10.6965385 12.2464844,10.6953846 C12.2753906,10.6907692 12.3042969,10.6873077 12.3332031,10.6842308 C12.3386719,10.6838462 12.3441406,10.6834615 12.3492187,10.6826923 C12.3746094,10.6803846 12.3992187,10.6788462 12.4242187,10.6773077 C12.4324219,10.6769231 12.4410156,10.6765385 12.4492187,10.6757692 C12.4789062,10.6746154 12.509375,10.6738462 12.5402344,10.6738462 C12.5703125,10.6738462 12.6003906,10.6746154 12.6308594,10.6757692 C12.6390625,10.6765385 12.6472656,10.6769231 12.6550781,10.6773077 C12.6804687,10.6788462 12.7054687,10.6803846 12.7300781,10.6826923 C12.7355469,10.6834615 12.7410156,10.6838462 12.7464844,10.6842308 C12.7757812,10.6873077 12.8042969,10.6907692 12.8332031,10.6953846 C12.8410156,10.6965385 12.8492187,10.6976923 12.8566406,10.6988462 C12.8789062,10.7023077 12.9011719,10.7061538 12.9238281,10.7107692 C12.9316406,10.7123077 12.9390625,10.7134615 12.9476562,10.715 C12.975,10.7211538 13.0023437,10.7273077 13.0296875,10.7338462 C13.0367187,10.7357692 13.04375,10.7376923 13.0503906,10.7396154 C13.071875,10.745 13.0925781,10.7507692 13.1128906,10.7569231 C13.1226562,10.76 13.1320312,10.7626923 13.1414062,10.7657692 C13.1644531,10.7726923 13.1875,10.7803846 13.2101562,10.7884615 C13.2183594,10.7915385 13.2269531,10.7946154 13.2355469,10.7976923 C13.2558594,10.8053846 13.2761719,10.8130769 13.2960937,10.8211538 C13.3066406,10.8257692 13.3175781,10.83 13.3277344,10.8346154 C13.3441406,10.8415385 13.3601562,10.8488462 13.3769531,10.8561538 C13.3863281,10.8603846 13.3960937,10.865 13.4050781,10.8696154 C13.4277344,10.88 13.4496094,10.8911538 13.4714844,10.9026923 C13.4832031,10.9088462 13.4945312,10.915 13.5058594,10.9219231 C13.5183594,10.9284615 13.53125,10.9357692 13.5433594,10.9426923 C13.5550781,10.9496154 13.5667969,10.9561538 13.5792969,10.9634615 C13.5949219,10.9730769 13.6105469,10.9830769 13.6257812,10.9934615 C13.6425781,11.0038462 13.659375,11.015 13.6753906,11.0265385 C13.684375,11.0326923 13.69375,11.0392308 13.7027344,11.0453846 C13.715625,11.055 13.7289062,11.0646154 13.7417969,11.0742308 C13.7484375,11.0796154 13.7554687,11.0846154 13.7621094,11.0903846 C13.7875,11.1096154 13.8121094,11.1296154 13.8363281,11.1503846 C13.8417969,11.1546154 13.846875,11.1592308 13.8523437,11.1638462 C13.8660156,11.1757692 13.8796875,11.1880769 13.8929687,11.2003846 C13.8976562,11.2046154 13.9019531,11.2088462 13.9066406,11.2126923 C13.95,11.2538462 13.9917969,11.2973077 14.0316406,11.3419231 C14.0347656,11.345 14.0371094,11.3480769 14.0398437,11.3511538 C14.08125,11.3980769 14.1199219,11.4469231 14.15625,11.4976923 C14.1574219,11.4992308 14.1589844,11.5011538 14.1601562,11.5026923 C14.2109375,11.5734615 14.2566406,11.6476923 14.2976562,11.7246154 C14.4398437,11.9938462 14.5207031,12.3 14.5207031,12.6242308 C14.5207031,13.7011538 13.6335937,14.5746154 12.5402344,14.5746154 C11.4460937,14.5746154 10.5589844,13.7011538 10.5589844,12.6242308 C10.5589844,12.3 10.6398437,11.9938462 10.7824219,11.7246154 L10.7824219,11.7246154 Z M16.2605469,15.6938462 C16.2605469,16.0311538 15.9824219,16.3046154 15.6402344,16.3046154 L9.43945312,16.3046154 C9.096875,16.3046154 8.81914062,16.0311538 8.81914062,15.6938462 L8.81914062,11.7253846 L9.66640625,11.7253846 C9.575,12.0088462 9.52578125,12.3107692 9.52578125,12.6242308 C9.52578125,14.2634615 10.8753906,15.5919231 12.5402344,15.5919231 C14.2046875,15.5919231 15.5542969,14.2634615 15.5542969,12.6242308 C15.5542969,12.3107692 15.5046875,12.0088462 15.4132812,11.7253846 L16.2605469,11.7253846 L16.2605469,15.6938462 L16.2605469,15.6938462 Z M16.2777344,10.1938462 C16.2777344,10.4588462 16.059375,10.6738462 15.790625,10.6738462 L15.0078125,10.6738462 C14.7386719,10.6738462 14.5207031,10.4588462 14.5207031,10.1938462 L14.5207031,9.42346154 C14.5207031,9.15884615 14.7386719,8.94384615 15.0078125,8.94384615 L15.790625,8.94384615 C16.059375,8.94384615 16.2777344,9.15884615 16.2777344,9.42346154 L16.2777344,10.1938462 L16.2777344,10.1938462 Z" id="Fill-2" fill="#FFFFFF"></path>
        </g>
    </g>
</svg>