<?xml version="1.0" encoding="UTF-8"?>
<svg width="25px" height="25px" viewBox="0 0 25 25" version="1.1" xmlns="http://www.w3.org/2000/svg" xmlns:xlink="http://www.w3.org/1999/xlink">
    <!-- Generator: Sketch 47.1 (45422) - http://www.bohemiancoding.com/sketch -->
    <title>icon-facebook</title>
    <desc>Created with Sketch.</desc>
    <defs></defs>
    <g id="stuff" stroke="none" stroke-width="1" fill="none" fill-rule="evenodd">
        <g id="icon-facebook">
            <path d="M9.11612426,10.745932 L10.7344675,10.745932 L10.7344675,9.24556213 C10.7344675,9.24556213 10.6667899,8.2647929 11.4108728,7.52034024 C12.1549556,6.7762574 13.1568047,6.84689349 14.5832101,6.97078402 L14.5832101,8.64571006 L13.5288462,8.64571006 C13.5288462,8.64571006 13.0857988,8.63683432 12.8772189,8.87573964 C12.6693787,9.11538462 12.691568,9.45673077 12.691568,9.54068047 L12.691568,10.745932 L14.5214497,10.745932 L14.2862426,12.6113166 L12.6823225,12.6113166 L12.6823225,17.4164201 L10.7418639,17.4164201 L10.7418639,12.6024408 L9.11612426,12.6024408 L9.11612426,10.745932" id="Fill-2" fill="#FFFFFF"></path>
        </g>
    </g>
</svg>