<?xml version="1.0" encoding="utf-8"?>
<!-- Generator: Adobe Illustrator 19.2.0, SVG Export Plug-In . SVG Version: 6.00 Build 0)  -->
<svg version="1.1" id="Calque_1" xmlns="http://www.w3.org/2000/svg" xmlns:xlink="http://www.w3.org/1999/xlink" x="0px" y="0px"
	 viewBox="0 0 253 547.7" style="enable-background:new 0 0 253 547.7;" xml:space="preserve">
<style type="text/css">
	.st0{fill:#FFF100;}
	.st1{fill:#EC008C;}
	.st2{fill:#00A14B;}
	.st3{fill:none;stroke:#000000;stroke-width:2;stroke-linecap:round;stroke-linejoin:round;stroke-miterlimit:10;}
	.st4{fill:#FFFFFF;}
	.st5{fill:#FFFFFF;stroke:#000000;stroke-width:2;stroke-linecap:round;stroke-linejoin:round;stroke-miterlimit:10;}
</style>
<g>
	<rect x="3.5" y="4.7" class="st0" width="247.9" height="411.8"/>
	<path class="st1" d="M176.6,306.1c1.4,6.2,3.4,12.3,5.1,18.5c0.9,3.2,1.7,6.5,2.4,9.8c0.7,3.1,1.9,6.3,2,9.5c0.1,2-0.5,3.5,0.8,5.3
		c1.6,2.2,4.2,2.7,6.8,2.5c3.4-0.3,5.6-3.2,7.4-5.8c2.2-3.2,1.2-6.1,0.7-9.6c-0.2-1.3,0.3-2.6-0.1-3.8c-0.6-1.7-2.4-2.9-3.2-4.5
		c-1.8-3.9-1.3-7.7-2.3-11.7c-1.7-6.5-3.1-13.1-6.2-19c4.4-2.2,7.5-7.9,6.2-12.9c-0.7-2.5-2.4-4.7-3.1-7.3c-1-3.5-2.3-6.8-3.3-10.2
		c-1-3.5-0.8-7.1-2.3-10.5c-0.5-1.2-2-2.2-1.2-3.5c0.6-1.1,2.9-1.6,3.9-2.5c2.3-2.1,2-5.7,1.3-8.6c-0.6-2.5-1.9-4.8-2.3-7.4
		c-0.5-3.1,0.7-4.5,2.3-7.2c0.9-1.6,0.9-3.4,1.2-5.1c0.7-3.7,1.6-7.2,1.6-11c0-3.9,2.2-7.1,2.4-10.8c0.1-2.2,0-4.4,0-6.7
		c0-1.7,0.4-4-0.5-5.5c-2.7-0.8-5-0.1-7.6-0.1c-3.3,0.1-7.2-0.2-10.4,0.5c-4.7,1-8.1,5-10.2,9.1c-2.1,4.1-2.1,8.7-1.1,13.2
		c1.2,4.8,4.4,8.9,4,14c-2-1.1-3.6-2.4-5.8-3.1c-1.3-0.4-2.6-1-3.9-1.1c-1-0.1-2.2,0.4-3-0.4c3.7-2.9,7.1-6.8,10-10.5
		c2.5-3.1,4.7-6.3,7.7-9c2.4-2.2,5.4-3.7,7.6-6.1c2.1-2.3,4.1-4.9,5.2-7.8c1.3-3.2,1.6-7.4,2.1-10.8c0.6-4.1,0.8-8.3,1.2-12.5
		c0.2-3.1,0.3-6.4,0.3-9.5c0.1-2.9,0.4-5.7,0.4-8.7c0-5.1-2.2-7.4-7.5-8c-0.5-3.9-0.6-9.3,0-13.3c6-2.8,4.8-11,4.7-16.6
		c-0.1-4.6,0.5-9.1,1.4-13.6c0.9-4,2.7-8.8,2-12.9c-1-5.3-5.8-6.9-10.6-7.3c-13.4-1.3-26.5,1.5-39.9-1.3c-5.4-1.1-10.9-3-16.4-3.6
		c-4-0.4-7,0.8-8.7,4.6c-2.2,4.9-2.7,10.8-3.3,16.1c-0.6,4.8-1.5,10.3-0.5,15.1c1.4,6.8,9.3,4.2,14.3,4.4c5.9,0.2,11.4,2.7,17.2,3.8
		c7.2,1.3,14.2,2.5,21.2,4.7c0.5,3.9,1,8.7,0.4,12.8c-1.5-0.8-2.8-1.9-4.5-2.6c-1.5-0.6-3-1.2-4.5-1.7c-6.4-2.1-12.9-4.4-19.6-5.1
		c-3.1-0.3-6.1-0.5-9.4-0.8c-4-0.4-8-1.9-12-2.8c-0.2-1.9,0-3.6,0.2-5.4c0.3-2-0.1-4,0.1-6c0.4-3.6,0.4-7.3,0.4-11
		c0-3-0.4-5.9-0.1-8.9c0.2-2.5,1.5-5,2.9-7.1c2.3-3.5,5.2-3.7,8.9-2.2c3.7,1.5,7.1,3.1,11.2,3.5c4.1,0.4,8.2,0.6,12.2,1.6
		c5.2,1.2,10.4,2.8,15.8,2.6c4.4-0.2,9.1-1.6,12-5c2.4-2.7,3.1-6.3,3.7-9.8c0.8-4.6,1.6-9.3,1.9-14c0.2-3.2,0.6-7.7-1.7-10.3
		c-1.7-2-4.8-2.6-7.3-3.5c-3.9-1.4-7.7-3-11.5-4.6c-8.2-3.3-17-7-26-7c-4.1,0-8.1,0.7-12.2,0.7c-3.9,0-7.6-0.8-11.4-1.3
		c-6.7-0.8-13.2,0.7-15,7.8c-1.2,4.8-2.2,9.6-3.2,14.4c-1.1,5.4-2.8,12.3-0.5,17.6c1.4,3.2,4.3,4,7.1,5.5c2.4,1.2,4.7,3.5,4.8,6.3
		c0.1,2-1.3,3.4-2.1,5.2c-2.8,6-1.5,13.8-2.4,20.3c-0.3,2.2-0.3,4.1-0.1,6.3c0.2,2.7,0,4.1-2.3,5.7c-2.5,1.7-4.9,3.6-7.5,5
		c-5.4,3-11,5.7-15.8,9.8c-2.2,1.9-4.4,4-6.3,6.2c-2.9,3.2-6.6,6.6-8.6,10.4c-2.6,4.8-4,10.2-4,15.7c0,5.8,2.2,10.2,4.4,15.5
		c1.9,4.7,1.3,9.3,0.1,14c-3.4,13.3-4.2,27-7,40.4c-1.6,7.4-4.1,14.8-4.8,22.3c-0.3,2.6-0.4,5.9,1.6,7.8c1.9,1.7,4.8,1.6,7.2,1.7
		c-1,4.6-0.4,9.4-1.2,14c-0.8,4.3-2,8.8-3.1,13.1c-0.9,3.6-1.9,7.2-2.6,10.9c-0.6,2.8-0.7,4.2,1.4,6.2c1.9,1.9,0.6,3.9,0.1,6.4
		c-0.5,2.8-1.1,5.5-1.6,8.3c-0.9,5-1.7,9.7-3.5,14.5c-0.7,1.8-0.7,2.8,1.1,4c1.5,1,4.3,0.3,5.3,2c1,1.7,0.1,4.6,0.2,6.5
		c0.1,2.1,0,3.7-0.4,5.8c-1.1,5.6,0,11.3-1.8,16.9c-0.1,0.4-0.2,0.7-0.4,1.1c-1.6,4.5-4.4,9.6,0,13.3c4,3.4,11.3,3.7,14-1.4
		c2.3-4.4,2.4-10.9,3.2-15.7c1-5.4,0.8-11.9,3.2-16.9c2.3-4.8,3.3-9.6,4.1-14.9c0.8-5.2,1.8-10.4,2.9-15.6c0.9-4.3-0.3-8.1,0.2-12.5
		c3.7-0.5,7.8-0.1,11.5-0.1c3.4,0,7.1-0.4,10.4,0.1c-0.3,5.4,0.2,10.7,0.5,16c0.3,4.9-0.9,10.6,1.1,15.3c1.6,3.9,7,7.6,10.6,3.6
		c3.5-4,1.7-11.4,1.5-16.2c-0.2-6,0.3-12.1,0.2-18.1c1.9-0.2,3.7-0.3,5.6-0.7c1.4-0.3,3.2-1.8,4.8-1.4c0.3,2.3,0.4,4.8,0.6,7
		c2.1,19.9,4.2,39.9,6.5,59.8c0.6,5-1.8,12.7,4.3,14.4c2.8,0.8,5.6,1.7,8.5,1.7c2.7,0,5.4-0.9,7-3.2c1.4-2,0.8-5.5,1.3-7.9
		c0.5-2.8-0.5-5.7-1.2-8.6c-1.2-4.8-2.5-9.7-3-14.6c-0.3-3.5-1.4-8.6-0.3-11.9c0.5-1.6,2.7-2.8,3.8-4.1c1.7-1.9,2.2-4.7,2.3-7.1
		c0-2.2-1-4-1.2-6.1c-0.4-6.1,0.1-11.9-2-17.8c-0.6-1.6-1.2-2.4-0.2-4c0.4-0.6,1-1,1.3-1.7c0.3-0.6,0.1-1.4,0.4-2
		c0.7-1.2,2.4-1.9,3.4-2.8c1.3-1.1,2.6-2.3,3.8-3.5c1.7-1.6,3.5-4.7,5.8-5.5c0.9-0.3,1.9,0.2,2.7-0.4c0.1,2.3,2.1,3.5,2.8,5.5
		C176.4,301.1,176.1,303.8,176.6,306.1z"/>
	<g>
		<path class="st2" d="M194.5,448.9c-0.1-0.2-0.2-0.3-0.4-0.4c3.1,8.4,4.1,17.1,6.4,25.6c1.1,3.9,2.6,8.1,5.9,10.5
			c2.8,2.1,6.6,2.6,10,2.6c3.5,0,9.1-0.1,11.9-2.2c3.4-2.5,4.6-6.9,5.6-10.9c1.3-5.2,2.2-10.5,4.1-15.5c1.5-4,3.8-7.5,6.4-10.9
			c2-2.7,2.4-5.5,2.9-9.3c0.4-3.1,1-7.6-2.2-9.8c-1.7-1.2-7.9-1-10.1-1c-2.2,0-7.1,0-9.3,0c-4,0-6.4,3.1-6.4,6.8
			c0,3.4,1.3,6.4,1.8,8.8c0.7,3.6,1.3,6.5,0.9,10.2c-0.3,2.7-3.4,5.8-6.1,3.5c-1.4-1.2-1.8-3.5-2-5.2c-0.5-3-0.1-5.8,0.7-8.7
			c0.7-3,1.4-6.1,0.6-9.1c-0.5-1.8-1.2-4.1-2.9-5c-1.5-0.8-3.7-0.9-5.4-1c-3.8-0.4-7.6-0.1-11.5-0.1"/>
		<path class="st2" d="M143.9,454.5c1.8-3.4,5.1-5.3,8.8-4.7c4.8,0.9,7.4,4.2,9.2,7.7c0.8,1.6,5.8,13.6,8.6,8c1.5-3,0-7.3-1.3-10.1
			c-1.5-3.3-3.8-5.9-6.2-8.5c-3.3-3.5-6.7-9.1-5.1-14.1c1.9-5.9,10.1-5.3,14.9-5c3.4,0.2,6.7,0.2,10.1,0c3.3-0.2,7.2-0.6,10.2,1.2
			c7.6,4.6,0.6,16.4-0.6,22.4c-0.5,2.6-0.6,5.4-0.9,8.1c-0.8,8.8-0.5,22.5-9.7,27.2c-3.9,2-9.2,1.7-13.4,1.4c-2.6-0.2-5.3-0.8-7.6-2
			c-1.1-0.6-2.4-1.4-3.3-2.3c-0.8-0.8-1.3-2.1-2.4-2.6"/>
		<path class="st2" d="M101,432c-0.6,2.2-0.4,5,0.2,7.6c0.7,3.4,0.8,6.6-0.3,9.9c-0.6,1.8-1.4,3.9-2,5.7c-1.4,3.9-8.5,17.2-9.8,19.5
			c-1.4,2.5-2.1,5.3-1.5,8.2c0.7,3.5,3,4.5,6.3,4.6c3.6,0.1,7.2-0.1,10.8,0c3.6,0.1,7.2,0.2,10.7-0.9c1.7-0.5,3.3-1.4,3.7-3.2
			c0.5-2.2-0.3-4.3-1.3-6.2c-0.4-0.8-2.2-4.9-1.8-6c0.5,0,2.6,0,5.1,0c2.4,0,4.6-0.1,4.6,0c0.7,1.9-1,4.4-1.6,6
			c-0.8,2.1-0.6,4.6,0.1,6.7c1.3,3.6,5.4,3.3,8.5,3.3c5.9,0,11.7,0.9,17.6,0.1c3.7-0.5,5.6-4.2,5.4-7.7c-0.3-7.8-7.3-12.7-10.4-19.2
			c-0.8-1.8-2.8-7.9-3.4-10.9c-0.7-3.3-0.2-7.4,0.2-10.7c0.3-2,0.1-4-0.3-6c-0.3-1.6-3-5.1-6.6-5.2c-2.7-0.1-10.6,0.1-14.4,0.1
			c-5.3,0-11.6-0.4-13.5-0.2C104.3,427.9,101.8,429.1,101,432z"/>
		<path class="st2" d="M83.6,427.8c-1.2,0-10.8,0-14,0c-3.6,0-8.1-1.5-10.6,4.6c-1.6,3.8-6,8.2-8.1,8.2c-2.2,0-5.7-5.9-6.6-7.4
			c-2-3.6-6.5-5.2-10.3-5.4c-3.7-0.3-7.2,0-10.9,0c-2.1,0-4.2-0.1-6.3,0c-1.7,0-5.3-0.2-7,0c-3.3,0.4-4.8,2.9-5.1,5.9
			c-0.3,3,2.8,8.6,3.5,9.8c1.5,2.4,2.7,4.9,3.3,7.8c0.6,3.5,0,7.4-1,10.8c-1.2,4.3-7,11.4-7.6,16.8c-0.2,2.1,0.2,5.9,1.8,7.6
			c1.6,1.7,4.9,1.4,7,1.4c3,0,18.7-0.2,20-0.2c4.2,0,8.3-3.6,9-6.6c0.9-4.1-2.6-10-4.5-13.4c-1.5-2.6-4-6.7-3.6-9.9
			c0.3-2.3,3.5-3.4,4.9-1.5c1.3,1.9,4,7.3,5.1,9.3c1.2,2,3.2,6.7,7,6.8c4.1,0.1,6.2-4.6,8.3-8.1c0.9-1.6,2.7-4.9,4.3-7.7
			c1.2-2,4.1-1.5,4.7,0.3c0.7,2-5,11.1-6.1,12.9c-2.1,3.2-4.5,7.6-3.8,11.6c0.9,4.9,5.2,6.4,7.3,6.4c2.3,0,23.5,0.5,26.5-1
			c2.2-1.1,3.3-3.6,3.9-6c1.3-5.6,0-12.2-2.3-17.5c-0.7-1.7-2-3.1-2.7-4.8c-1.1-2.6-1.4-5.9-1.4-8.7c0-3.5,0.3-6.5,0.9-10
			c0.6-3.1,3-8.3,0.8-10.9C88.8,427.6,85.5,427.9,83.6,427.8z"/>
	</g>
	<path class="st2" d="M72.5,508.9c2-2.4,7.5-13,6-16.3c-1.1-2.3-1.4-4.8-4.3-4.9c-6-0.3-15.2,0-15.8-3.1c-1.5-0.1-4.4-0.8-10.6-0.7
		c-3.6,0-15.4,4.1-17.3,3.8c-1.9-0.2-12.2-0.9-14-0.2c-2.6,1.1-5.4,1.2-6.7,3.9c-1,2.1-1.2,4.1-0.9,6.2c0.6,4.4,6.3,8.6,10.2,8.7
		c0.9,3,1.4,6.8,0.1,9.7c-1.2,2.9-9.7,7.2-11.2,10c-1.2,2.3-2.5,5.5-2.4,8.1c0.1,2.7,2,6.4,4.1,8.4c1.8,1.7,4.9,2.5,7.3,2.8
		c3.4,0.4,7.2,0.5,10.6,0.2c0.6-0.1,1.2-0.1,1.8-0.2c3.4,0.4,7.8-0.8,10.7-1.1c8.1-0.8,16.2,1.3,24.3,0.4
		c7.4-0.8,13.9-3.1,16.5-11.1c2.5-7.7-2.9-14.3-7.5-20C72.7,512.5,72.2,510.5,72.5,508.9z M49.5,526.4c-1,1.1-3.7,0.5-5,0.9
		c-0.8-0.4-1.5-0.8-2.1-1.2c-1.9-1.6-2.7-3.9-1-5.9c1.1-1.3,2.8-2,4-3.2c1.7,0.1,3.6,0.4,4.4,2.1C50.6,521,50.8,524.9,49.5,526.4z
		 M50.7,503.1c-1.1,2.5-3.2,2.7-5.3,2.9c-0.2-0.3-0.4-0.6-0.7-0.9c-1.2-1.3-2.8-2.5-2.8-4.5c0.1-2.1,1.9-3.8,3.8-4.5
		C50,494.7,52.2,499.6,50.7,503.1z"/>
	<path class="st2" d="M141.8,517.4c-0.5-1.2-1.8-1.8-2.6-2.7c-0.2-0.2-0.3-0.4-0.5-0.6c0-0.5,0-1.1-0.1-1.6c-0.5-2-1.9-3.7-2.7-5.5
		c-1-2.5-1-5.5,0.2-7.9c1.9-3.8,1.8-7.9-2-10.4c-4.1-2.7-9.5-2.6-14.2-2.1c-4.7,0.5-9.3,0.9-14,0.9c-3.8,0-9.5-0.8-12.9,1.6
		c-2.8,2-2.1,6.8-2.1,9.8c0,1.7,0.8,6,0.6,7.7c0,0.1-8.2,16-7.4,19.3c1.4,6.5,5.4,13.8,10.7,17.6c0.9,0.7,3.7,0.6,4.8,0.8
		c1.4,0.3,3.2,0,4.7,0c3.3,0,6.5,0.1,9.8,0.1c3.6,0,7.2,0.2,10.7-0.4c0.1,0,0.3,0,0.4-0.1c2.3-0.4,4.6-1.2,6.7-2.2
		c4-2,7.4-4.9,8.3-9.4C141.3,527.6,143.8,522,141.8,517.4z M118.6,517.6c-2.5,1.6-5.9,0.4-7.5-2c-1.7-2.6-1.8-7.5,0.6-9.7
		c2.8-2.6,5.7,0.6,7,3c1.1,2.1,1.6,4.4,2.2,6.6C120.2,516.3,119.5,517.1,118.6,517.6z"/>
	<path class="st2" d="M235.6,485.2c-1-1-2.1-1.4-3.7-2.1c-3,2.5-14.4,4.3-15.5,4.2c-3.3-0.1-8.8-1.6-11.7-4.5
		c-4.2-0.3-7.3,0.8-9.5,6.6c-1.2,3.3-2.1,7.3-1.3,10.8c0.6,2.4,0.9,6.3,3,7.7c1.9,1.3,11,5.3,12.8,5.8c3,0.9,5.7,2.5,6.7,5.6
		c0.6,2.1,0.6,3.8-1.4,4.9c-1.7,0.9-3.7,0.5-5.4-0.1c-1.7-0.6-8-5.1-9.9-6c-3.3-1.6-9.1-0.6-11.2,2.8c-1.2,1.9-1.9,4.2-1.9,6.4
		c-0.1,3.9,2.3,7.6,1.9,11.4c-0.6,5.9,7,5.9,8.7,6.2c1.8,0.3,3.5,0.6,5.3,0.5c0.1,0,0.2,0,0.3,0c2.4-0.3,4.7-0.9,7.2-1
		c3.3-0.2,6.5,0.7,9.7,0.7c3-0.1,6-0.6,8.8-1.7c1.6-0.6,3.1-1.4,4.5-2.4c3.9-2.8,5.7-6.9,6.7-11.4c1.8-8.3-2.7-15.8-10-19.5
		c-2.9-1.4-7-2.4-9-5c-1.6-2.1-1.4-6.1,1.5-7.1c3.6-1.2,7.1,3.5,10,4.7c3.5,1.4,7.1-0.4,8.4-3.9c1.4-4.1-1.4-8.8-3.8-12
		C236.4,486.1,236,485.6,235.6,485.2z"/>
	<path class="st2" d="M182.9,499.1c-2.1,3.1-6.5,6.6-7.9,8.4c-1.9,2.5-1.4,4.9-0.1,7.7c1.6,3.4,4.5,5.8,6.7,8.8
		c1.1,1.5,2.3,3,3.4,4.5c1.4,1.7,2.1,3.9,2.4,6.1c0.3,2-0.8,4.1-1.4,5.9c-0.6,1.8-1.6,3.7-3.5,4.5c-1.5,0.6-6.5,0.3-8,0.1
		c-1.5-0.2-8.1-1.8-9.6-1.8c-3.7-0.1-6.3,1.7-10,1.7c-4.3,0.1-7.3,1.1-10.4-2.5c-2.9-3.3-2.7-11-0.6-14.5c2.4-3.9,7.2-4.6,9.5-8.5
		c2.2-3.9,2-7.7,1.4-12c-0.2-1.7-0.5-3.5-1.5-4.9c-0.7-1.1-1.8-1.7-2.8-2.4c-3-2.4-4-6.5-2.2-10c2.7-5.4,5.2-5.5,10.5-5.5
		c3.2,2.4,8.5,4.1,11.8,4.2c2,0.1,8.1-0.8,10.2-2.8c2.6,0.8,2.5,2.6,2.5,5.1C183.5,493.8,184.3,497.1,182.9,499.1z"/>
	<g>
		<path class="st3" d="M136.4,118.7c-16.6-1.8-33.2-4.1-47.4,6.6c-7.2,5.4-14.8,11.2-21.2,17.6c-6.1,6.1-6.9,12.6-0.1,18.6
			c9.5,8.3,23.6,10.7,35.8,11.2c12.9,0.4,26.2-1,39-2.7c9.5-1.3,18.4-3.8,23.9-12.3c4.2-6.3,7.9-16.5,5-24.1
			c-2.9-7.6-13.7-10-20.6-12.3c-7.9-2.6-15.4-4.4-23.7-3.7"/>
		<path class="st3" d="M64.3,150.6c-3,8.3-7.5,22.6,1.4,28.8c7.6,5.3,19.3,7.7,28.2,9c5.9,0.9,11.8,0.8,17.7,1
			c6.9,0.3,13.6,0.5,20.5-0.5c14.6-2.2,27.2-7.1,35.6-19.8c4.1-6.2,5.8-13.1,7.7-20.2c2-7.5-1.2-13.2-5.3-19.5"/>
		<path class="st3" d="M66.3,179.6c-0.5,6.3-1.8,12.7-2.7,19.1c-1.1,8-2.3,16-3.8,23.9c-1.2,6.3-5.1,28.9-5.5,31.9"/>
		<path class="st3" d="M53.9,254.9c0,3.6,1.3,6.2,4.6,7.8c3.3,1.6,7.5,0.7,8.9-3.2"/>
		<path class="st3" d="M67.9,257.4c0.7-3.2,2.7-15.2,3.3-18.6c1.4-7.6,2.4-15.5,3.4-23.2c0.9-7,1.9-13.7,2.9-20.5
			c0.3-1.7,0.9-3.5,1.3-5.2c0.2-0.9,0.5-3.7,1.1-4.1"/>
		<path class="st3" d="M139.2,189.3c0.1,3.7,0.8,7.5,0.8,11.3c0,2.9,0.4,5.9,0.7,8.8c0.3,3.4,0.1,6.7,0.4,10.1
			c0.6,7.7,0.6,15.5,1.5,23.2c0.6,5.3,1.3,20.8,1.7,25.7"/>
		<path class="st3" d="M144.2,269.5c1.6,3.2,6.4,3.9,9.5,3.3c3.5-0.6,6.8-3.5,6.7-7.2"/>
		<path class="st3" d="M160.4,264.9c-0.3-7.6-2-15.5-2.3-23.3c-0.2-5.6-1-11.3-1.6-16.8c-0.3-2.5-0.3-5-0.6-7.5
			c-0.3-2.9-0.9-6-0.9-9c-0.1-4.5-1.2-8.9-1.5-13.4c-0.2-2.1-0.3-4.2-0.6-6.3c-0.2-1.3,0-5-1-5.6"/>
		<path class="st3" d="M169.7,166.9C169.7,166.6,169.7,166.6,169.7,166.9c0.8,2.9,1.1,6.7,1.4,9.7c0.2,1.9,0.2,3.8,0.5,5.8
			c0.9,6.1,1.6,12.2,2.7,18.4c0.6,3.7,1.1,7.4,1.9,11.1c0.4,1.8,0.6,3.7,1,5.6c0.3,1.3,1.2,2.9,0.9,4.2"/>
		<path class="st3" d="M178.2,221.3c2,1.2,3,3,5.8,2.7c2.8-0.3,5.9-1.5,6.2-4.6"/>
		<path class="st3" d="M190.9,219c-0.1-4.9-1.7-10.1-2.6-14.9c-1-5.2-2-10.4-2.6-15.7c-0.5-4.8-1.3-9.5-2.2-14.2
			c-1.8-9.6-4-19-5.3-28.7c-1.2-9.3-1.3-18.6-0.8-27.9c0.4-8.4,1.2-16.7,1.6-25.1c0.2-4.5,2-8.8,2.7-13.2c0.5-2.9,0.9-5.8,1.1-8.8
			c0.1-1.4,0-2.7,0-4.1c0-1.2,0.5-2.5,0.4-3.6"/>
		<path class="st3" d="M170.8,79.7"/>
		<path class="st3" d="M165,125.2c0-3.9,0.3-8.2,0.7-12.2c0.2-2.1,0.2-4.2,0.4-6.3c0.3-3.4,1.2-6.7,1.6-10.1
			c0.4-3.9,0.8-7.8,1.9-11.6"/>
		<path class="st3" d="M104.8,116c0.1,0.2,0.1,0.5-0.1,0.7c-1.2-1.5-0.1-5.6,0.1-7.2c0.4-3.2,0.8-6.4,0.8-9.6c0-3.1,0.7-6.1,1.2-9.2
			c0.5-3.2,0.3-6.5,0.8-9.7c0.3-2.2,0.8-4.2,0.8-6.3c0-0.3,0-0.3,0,0.1"/>
		<path class="st3" d="M126.4,30.8c-5.5-0.5-11.2-0.8-16.7,0c-1.6,0.2-4.4,0.1-5.8,1c-1.9,1.1-2.4,4.5-2.6,6.4
			c-0.2,1.7-0.3,3.3-0.6,5c-0.9,5.5-2.9,10.7-3.7,16.3c-0.4,3-1.3,7.1,0.2,9.9c1.7,3.1,5.9,3.8,9,4.7c3.2,1,6.2,2,9.5,2.6
			c13.5,2.5,27.1,4.1,40.7,6c3.2,0.4,6.8,0.3,9.9,1.1c1.6,0.4,3.1,1.2,4.9,1.1c11.8-0.9,11.1-17.6,12.5-25.8
			c0.9-5.4,4.3-11.4-1-15.4c-3.9-2.9-9-4.4-13.7-5.7c-5.8-1.7-11.7-2.9-17.6-3.9C143.2,32.6,134.8,31.6,126.4,30.8z"/>
		<path class="st3" d="M115.7,116.3c0-7.3,0.8-14.4,0.8-21.6c0-2.9,0.3-6.1,0.8-8.9c0.2-1.3,0.5-2.5,0.8-3.7c0.3-1.1,0.1-3,0.8-3.9
			c-0.1,0.2-0.2,0.5-0.4,0.7"/>
		<path class="st3" d="M76.3,204.7c1.1,3.1,8.5,4.2,11.3,4.8c5.1,1,10,1.8,15.1,2.4c5.4,0.6,10.8,0.6,16.3,0.6c3.7,0,7.6,0.3,11.3,0
			c1.6-0.1,11.8-0.6,11.7-2.7"/>
		<path class="st3" d="M74,220.5c1.8-0.3,4.5,1.4,6.3,2c2.6,0.8,5.3,1.4,8,1.8c5.7,0.9,11.9,1.1,17.7,1.2c4.7,0.1,9.4,0,14.1,0
			c3.7,0,7.4-0.4,11-0.4c2,0,4.2-0.3,6.2-0.6c1.5-0.2,4.6-0.4,5.5-1.7"/>
		<path class="st3" d="M156.2,203.9c2.1-2.8,4.8-4.8,6.7-7.8c1.8-2.7,2.7-5.8,3.9-8.8c0.8-2,4-5.9,2.4-7.8c-1.9-2.3-6.8-1.5-9.4-2.2
			c-0.2,0.3-0.7,0.4-0.9,0.7"/>
		<path class="st3" d="M156.6,219c0.9-2,4.1-3.8,5.8-5.4c2.3-2.3,4-4.8,5.6-7.6c0.8-1.4,7.2-11.5,5.2-12.5"/>
		<path class="st3" d="M61.2,263.8c0.1,1.1-0.2,2.3-0.4,3.4c-0.4,2.6-0.8,5.2-1.1,7.7c-0.5,4.5-1.4,9.1-2.3,13.6
			c-0.7,3.2-2,8.5-3.1,13.1"/>
		<path class="st3" d="M54.3,302.7c-0.3,3.8,3.4,6.1,6.6,6.9c3.7,0.9,8.5-1.8,8.5-4.6"/>
		<path class="st3" d="M69.8,304.2c0.4-1.4,6.3-26.2,7.6-32.4c2.2-11.1,2.8-22.5,4.7-33.6c0.4-2.5,0.5-5,1.1-7.4
			c0.3-1.2,1.1-4,0.7-5.1c-0.1,0.1-0.2,0.2-0.3,0.3"/>
		<path class="st3" d="M133.4,226.3c0,7.7,0.5,15.3,1.2,23c1,11.6,4.4,50.4,5.4,58.4"/>
		<path class="st3" d="M140,308.1c0.5,4.2,5,6,9.7,5.4c5.8-0.7,8.2-4.1,7.9-6.6"/>
		<path class="st3" d="M154.1,272.9c0.4,6.2,0.8,10.5,1.7,16.3c0.8,5.3,1.1,8.8,2,16"/>
		<path class="st3" d="M168.5,207c-2.1,1.2,1.4,9.7,1.8,11.6c1.2,5,2,10,3.2,15c0.9,3.8,1.6,7.7,2.7,11.4c0.7,2.5,2,4.9,2,7.5
			c0.2,0.1,0.3-0.1,0.3-0.4"/>
		<path class="st3" d="M177.8,249.9c2,3.8,3.7,3.8,7.9,3.9c2.8,0,7.2-2.3,6.7-5.8"/>
		<path class="st3" d="M192.4,248.7c-1.2-4.6-2.7-9.6-3.4-14.4c-0.3-2.1-0.7-4.3-1-6.4c-0.1-1.1-0.3-5-1.5-5.4"/>
		<path class="st3" d="M57.6,309.3C57.6,308.9,57.7,308.8,57.6,309.3c-0.7,3.5-3.4,15.9-3.7,18.4c-0.3,2.5-2,10.4-2.8,14"/>
		<path class="st3" d="M51.5,342.2c0,3.2,5.2,5.2,7.9,5.4c5.1,0.3,6.8-0.9,8.8-5.8"/>
		<path class="st3" d="M80.5,253.3c1.7-0.2,4.2,0.8,5.8,1.2c2.6,0.7,5.3,1.2,8,1.5c5.5,0.5,11.1,0.4,16.7,0.4c4.1,0,8.2,0,12.3,0
			c1.9,0,3.9,0.1,5.8-0.1c1.4-0.2,4.5,0,5-1.8"/>
		<path class="st3" d="M79.4,265.3c2.1-0.3,4.9,0.8,7,1.2c2.8,0.6,5.7,1.1,8.5,1.4c3.7,0.5,7.3,0.8,11.1,0.8c7.3,0,28-0.7,29.6-3.6"
			/>
		<path class="st3" d="M158.1,248.3c3.9-6.9,10-13.5,12.1-21.2c2.1-7.8-8.4-8.9-13.6-7.7"/>
		<path class="st3" d="M160,258.7c1.8-0.5,3-2.3,4.2-3.5c1.4-1.4,2.7-2.6,3.9-4.3c1.2-1.7,2.6-3.3,3.8-4.9c0.8-1,2.4-2.4,2.3-3.9"/>
		<path class="st3" d="M68.5,340.9c1.9-11,5.5-26.8,6.7-31.8c2.1-9.4,4.3-18.8,6.5-28.1c0.5-2.3,1-4.8,1.7-7.1
			c0.6-2.1,1.8-4.4,1.9-6.6c0-0.3,0-0.3,0,0.1"/>
		<path class="st3" d="M129.9,268.4c-0.2,3.5,1.1,6.9,1.5,10.3c0.6,4.7,0.5,9.4,0.9,14.1c0.7,8.4,1.4,16.8,2.3,25.2
			c1,9.4,2.1,16.8,3.7,26"/>
		<path class="st3" d="M138.4,344.8c1.5,4.1,9.5,5.4,12.8,4.5c1.7-0.5,9.5-5,8.8-8.4"/>
		<path class="st3" d="M155.1,312.6c0.9,3.1,3.2,20.8,4.7,27.7"/>
		<path class="st3" d="M172,247.9c-1.9,1,1.2,9.4,1.8,10.8c1.7,4.5,2.7,9,3.7,13.8c0.9,4,3.8,14.8,4.7,17.8"/>
		<path class="st3" d="M182.4,291.2c0.7,3.9,5.2,6.8,8.9,5.5c3.3-1.2,5.8-4.4,5.4-7.1"/>
		<path class="st3" d="M187,254.5c-0.1,3.2,1.4,6.3,2.3,9.3c1.1,3.9,5,17.2,7.3,25.3"/>
		<path class="st3" d="M77.8,295.8c3.6,2.8,8.8,2.6,13.1,3.5c5.2,1,10.5,1,15.8,1.6c4.2,0.5,8.9,0,13.1-0.1c4.4,0,8.3-1.5,12.7-2
			c0.1-0.3,0.1-0.8,0.1-1.1"/>
		<path class="st3" d="M75.5,309.7c6.9,1.9,13.9,2.6,20.8,3.6c5,0.7,12.4,1.7,17.5,1.5c4-0.1,13.8-1,19.6-2.4"/>
		<path class="st3" d="M156.2,290.8c6.3-5.7,12.6-12.4,17.4-19.4c5.9-8.8-7.1-10.8-13.1-10.7"/>
		<path class="st3" d="M159.1,305c1.9-1.5,9.6-10.5,11.6-12.3c1.2-1.1,7-7.5,8.3-10.3"/>
		<path class="st3" d="M157.7,305.8"/>
		<path class="st3" d="M59.7,347.9c-1.3,1.8-1.2,5.6-1.6,7.8c-1,5.4-3.9,25.3-4.7,28.6"/>
		<path class="st3" d="M53.5,385.7c-0.1,2.8,3,6.8,8.7,7.3c5.7,0.5,8.1-4,8.6-5.8"/>
		<path class="st3" d="M70.9,386.1c1.9-11.1,2.8-15.6,4.2-23.3c1.4-7.4,2.2-14.8,3.5-22.2c1-5.8,4.4-24.5,5.4-28.9"/>
		<path class="st3" d="M128.4,315.5c0,3.4,0.7,6.7,1.1,10c0.5,4.8,0.6,9.5,1.1,14.3c0.9,8.7,2,17.4,3.3,26.1
			c0.8,5.8,2.8,19.1,3.6,24.3"/>
		<path class="st3" d="M138,391.5c1.5,3.2,7.1,5.7,12.2,4.9c4.1-0.6,8.7-6.5,8.6-8.4"/>
		<path class="st3" d="M158.3,386.1c-0.8-5.5-3.9-28.9-5.9-37.5"/>
		<path class="st3" d="M173.1,292.3c2.3,9.4,13.5,55.3,14.3,57.9"/>
		<path class="st3" d="M187.8,350.2c2.1,2.5,7.4,3.6,10.2,2c3-1.7,5.1-6.1,4.8-9.8"/>
		<path class="st3" d="M202.9,342.1c0.2-1.3-2.8-11.6-3.7-14.9c-1.2-4.5-7.3-27.2-8.2-30.3"/>
		<path class="st3" d="M179.1,122c1.9,0.5,5.2,2,7.2,0.9c3.7-2.1,2.3-10.4,2.4-13.8c0.2-6,0.7-12,1.8-17.9c0.6-3.6,1.7-8.4,0.3-11.9
			c-1.3-3.2-5-4.4-8-5.6c-0.1-0.2-0.1-0.5-0.1-0.7"/>
		<path class="st3" d="M182.5,123.4c-0.2,4.4-1.1,15.1-1.4,19.2c-0.4,5.5-0.5,10.9-0.5,16.5"/>
		<path class="st3" d="M184,136.3C183.6,136.3,183.6,136.3,184,136.3c2.1,0.2,3.9,0.8,5.5,2.4c1.4,1.4,1.1,2.9,1.1,4.7
			c0,5.1-0.9,10.3-1.5,15.3c-0.5,4-0.3,8.1-0.8,12.2c-0.4,3.2-0.9,6.4-3.1,8.9c0-0.2,0-0.4,0-0.6"/>
		<path class="st3" d="M187.8,201.1c0-6.1,0.1-12.1,0.4-18.1c0.2-3,0.9-12.1,1.1-15.8"/>
		<path class="st3" d="M189,187.6c0.9-0.6,4,0.2,5.2,0.5c2.9,0.9,2.5,3.2,2.5,5.9c0,5.1-1.1,10.2-1.7,15.2c-0.5,4.5-1,9.2-1.8,13.7
			c-0.5,2.7-1.1,6.8-3.9,8.3"/>
		<path class="st3" d="M117.2,108.1c9,0,17.3,2.2,26.1,3.2c3.6,0.4,7.4,1,10.9,1.7c1.7,0.3,3.4,0.8,5,1.2c1.4,0.3,3.1,1.3,4.5,1.3
			c-0.2,0-0.4,0-0.7,0"/>
		<path class="st3" d="M112,57.5c0.2,1.7,2.5,1.9,3.8,1.4c1.1-0.5,1.9-1.9,2.3-3c0.8-2.3,0.1-5.4-2.3-6.6c-6-2.9-7.6,6.1-4.2,9.4"/>
		<path class="st3" d="M165.8,65.5c0.2,2.6,3.7,2.3,5,1c1.6-1.7,2.3-5.1,0.7-7c-4.6-5.3-11.3,3.8-5.7,7.5"/>
		<path class="st3" d="M117.2,91.9c-0.2,1.8,2.1,2.3,3.4,1.7c1.1-0.5,1.9-1.9,2.2-3c0.6-2.4-2.5-6.3-5.2-5.6"/>
		<path class="st3" d="M105.2,315.5c0.1,7.2-0.8,25.2-0.2,29c0.4,2.3,3,6.6,9,6.3c4.9-0.2,6.8-4.2,6.8-6.3c0.1-6,0.3-25.5,0.1-29.1"
			/>
	</g>
	<rect x="2" y="2.9" class="st3" width="250" height="414.9"/>
	<path class="st4" d="M124,451.4c0.6,1.8,0.6,3.1,0.5,5.1c0,1.4-1.1,1.8-2.2,1.9c-1,0.1-2.2,0.1-3,0.1c-0.7,0-1.4,0.1-2-0.3
		c-0.7-0.4-0.9-1.3-1-2c-0.2-1.5-0.2-3.4,0.6-4.8c0.4-0.7,2.2-2.6,2.8-3c0.5-0.3,1.6-0.4,2.1-0.1C122.3,448.6,123.8,450.8,124,451.4
		z"/>
	<path class="st3" d="M194.5,448.9c-0.1-0.2-0.2-0.3-0.4-0.4c3.1,8.4,4.1,17.1,6.4,25.6c1.1,3.9,2.6,8.1,5.9,10.5
		c2.8,2.1,6.6,2.6,10,2.6c3.5,0,9.1-0.1,11.9-2.2c3.4-2.5,4.6-6.9,5.6-10.9c1.3-5.2,2.2-10.5,4.1-15.5c1.5-4,3.8-7.5,6.4-10.9
		c2-2.7,2.4-5.5,2.9-9.3c0.4-3.1,1-7.6-2.2-9.8c-1.7-1.2-7.9-1-10.1-1c-2.2,0-7.1,0-9.3,0c-4,0-6.4,3.1-6.4,6.8
		c0,3.4,1.3,6.4,1.8,8.8c0.7,3.6,1.3,6.5,0.9,10.2c-0.3,2.7-3.4,5.8-6.1,3.5c-1.4-1.2-1.8-3.5-2-5.2c-0.5-3-0.1-5.8,0.7-8.7
		c0.7-3,1.4-6.1,0.6-9.1c-0.5-1.8-1.2-4.1-2.9-5c-1.5-0.8-3.7-0.9-5.4-1c-3.8-0.4-7.6-0.1-11.5-0.1"/>
	<path class="st3" d="M143.9,454.5c1.8-3.4,5.1-5.3,8.8-4.7c4.8,0.9,7.4,4.2,9.2,7.7c0.8,1.6,5.8,13.6,8.6,8c1.5-3,0-7.3-1.3-10.1
		c-1.5-3.3-3.8-5.9-6.2-8.5c-3.3-3.5-6.7-9.1-5.1-14.1c1.9-5.9,10.1-5.3,14.9-5c3.4,0.2,6.7,0.2,10.1,0c3.3-0.2,7.2-0.6,10.2,1.2
		c7.6,4.6,0.6,16.4-0.6,22.4c-0.5,2.6-0.6,5.4-0.9,8.1c-0.8,8.8-0.5,22.5-9.7,27.2c-3.9,2-9.2,1.7-13.4,1.4c-2.6-0.2-5.3-0.8-7.6-2
		c-1.1-0.6-2.4-1.4-3.3-2.3c-0.8-0.8-0.9-1.3-1.9-2.3"/>
	<path class="st3" d="M90.9,487.2c0.9,0.3,1.8,0.4,2.9,0.4c3.6,0.1,7.2-0.1,10.8,0c3.6,0.1,7.2,0.2,10.7-0.9
		c1.7-0.5,3.3-1.4,3.7-3.2c0.5-2.2-0.3-4.3-1.3-6.2c-0.4-0.8-2.2-4.9-1.8-6c0.5,0,2.6,0,5.1,0c2.4,0,4.6-0.1,4.6,0
		c0.7,1.9-1,4.4-1.6,6c-0.8,2.1-0.6,4.6,0.1,6.7c1.3,3.6,5.4,3.3,8.5,3.3c5.9,0,11.7,0.9,17.6,0.1c3.7-0.5,5.6-4.2,5.4-7.7
		c-0.3-7.8-7.3-12.7-10.4-19.2c-0.8-1.8-2.8-7.9-3.4-10.9c-0.7-3.3-0.2-7.4,0.2-10.7c0.3-2,0.1-4-0.3-6c-0.3-1.6-3-5.1-6.6-5.2
		c-2.7-0.1-10.6,0.1-14.4,0.1c-5.3,0-11.6-0.4-13.5-0.2c-2.9,0.3-5.3,1.5-6.2,4.4c-0.6,2.2-0.4,5,0.2,7.6c0.7,3.4,0.8,6.6-0.3,9.9
		c-0.6,1.8-1.4,3.9-2,5.7c-0.8,2.1-3.2,7.1-5.5,11.5"/>
	<path class="st5" d="M124,451.4c0.6,1.8,0.6,3.1,0.5,5.1c0,1.4-1.1,1.8-2.2,1.9c-1,0.1-2.2,0.1-3,0.1c-0.7,0-1.4,0.1-2-0.3
		c-0.7-0.4-0.9-1.3-1-2c-0.2-1.5-0.2-3.4,0.6-4.8c0.4-0.7,2.2-2.6,2.8-3c0.5-0.3,1.6-0.4,2.1-0.1C122.3,448.6,123.8,450.8,124,451.4
		z"/>
	<path class="st3" d="M83.6,427.8c-1.2,0-10.8,0.1-14,0c-5.7-0.2-8.4,0.8-10.6,4.6c-2.1,3.6-5.8,8.3-8.1,8.2
		c-2.2-0.1-5.3-4.7-6.6-7.4c-1.8-3.7-6.5-5.2-10.3-5.4c-3.7-0.3-7.2,0-10.9,0c-2.1,0-4.2-0.1-6.3,0c-1.7,0-5.3-0.2-7,0
		c-3.3,0.4-4.8,2.9-5.1,5.9c-0.3,3,2.8,8.6,3.5,9.8c1.5,2.4,2.7,4.9,3.3,7.8c0.6,3.5,0,7.4-1,10.8c-1.2,4.3-7,11.4-7.6,16.8
		c-0.2,2.1,0.2,5.9,1.8,7.6c1.6,1.7,4.9,1.4,7,1.4c3,0,18.7-0.2,20-0.2c4.2,0,8.3-3.6,9-6.6c0.9-4.1-2.6-10-4.5-13.4
		c-1.5-2.6-4-6.7-3.6-9.9c0.3-2.3,3.5-3.4,4.9-1.5c1.3,1.9,4,7.3,5.1,9.3c1.2,2,3.2,6.7,7,6.8c4.1,0.1,6.2-4.6,8.3-8.1
		c0.9-1.6,2.7-4.9,4.3-7.7c1.2-2,4.1-1.5,4.7,0.3c0.7,2-5,11.1-6.1,12.9c-2.1,3.2-4.5,7.6-3.8,11.6c0.9,4.9,5.2,6.4,7.3,6.4
		c2.3,0,23.5,0.5,26.5-1c2.2-1.1,3.3-3.6,3.9-6c1.3-5.6,0-12.2-2.3-17.5c-0.7-1.7-2-3.1-2.7-4.8c-1.1-2.6-1.4-5.9-1.4-8.7
		c0-3.5,0.3-6.5,0.9-10c0.6-3.1,3-8.3,0.8-10.9C88.8,427.6,85.5,427.9,83.6,427.8z"/>
	<path class="st3" d="M22.4,485.7"/>
	<path class="st3" d="M27.8,486"/>
	<path class="st3" d="M37.5,485.8"/>
	<path class="st3" d="M56.1,485.8"/>
	<path class="st3" d="M13,488.2c-2.8,3.1-4.2,8.4-2.7,12.5c0.6,1.6,3.3,5.3,7.4,5.5c1.5,0.1,1.9,1,1.9,2.6c-0.1,3,0.2,6.2-1.9,8.7
		c-1.8,2.2-3,2.7-5.5,4c-5.2,2.9-7.1,7.4-7.1,11.4c0,3.3,2.5,10.7,10.7,11.9c2.4,0.4,16.9-0.2,21.6-0.3c3.3-0.1,16.1-0.3,19.3-0.3
		c3.6,0,7.2-0.1,10.8-0.2c2.7-0.1,5.3-1,7.6-2.4c3.8-2.4,6.3-6.7,7-11.2c0.4-2.8-0.2-5.6-1.5-8c-1.5-2.8-3.9-4.8-6-7.1
		c-1.8-1.9-2.7-4-1.5-6.5c1.1-2.3,3-4.1,4.2-6.4c2.4-4.5,1.6-9.6-0.5-14"/>
	<path class="st3" d="M120.9,512.7c-0.1-3.2-1.7-6.3-5.6-6.4c-4.5-0.1-5.4,4.2-5.5,6.4c-0.1,2.5,1.4,5.9,4.9,5.9
		C118.3,518.6,121,516,120.9,512.7z"/>
	<path class="st3" d="M154.2,485.5c-1.7,0.7-3.1,1.8-4.1,3.1c-1.8,2.2-2,5.7-1.2,8.6c1,3.9,7.3,8.4,7.3,13.9
		c0,8.3-4.7,10.8-9.8,14.8c-2.3,1.8-3.5,5.7-4.1,8.6c-0.4,1.8-0.4,3.5,0.1,5.3c0.7,2.5,2.8,4.2,5.3,4.8c5.2,1.3,10.5-0.9,16.7-0.9
		c5.9,0,9.9,0.8,12.7,1.1c5.3,0.6,10.1-0.3,11.4-5.7c1.5-6.4-2.5-12.8-6.9-17c-3.2-3-6.5-5-6.5-9.7c0-6,4.5-9.2,5.4-10.1
		c1.6-1.6,3.1-3.2,3.7-5.4c0.5-2,0.7-4.1,0.2-6.2c-0.5-2.1-1.3-2.2-2.3-4"/>
	<path class="st3" d="M92.6,486.8c-2.7,2.1-1.7,5.4-1.4,8.1c0.3,2.5,0.8,5.6,0.7,8.2c-0.1,5.2-5.1,9.9-6.1,14.1
		c-1.2,5.1-1.7,13.4,2,19.4c3.8,6.3,8.6,8.2,15.6,8.1c2.4,0,8.3,0,10.7-0.1c2.4-0.1,4.8-0.2,7.3-0.3c2.5-0.1,5.1,0.2,7.6-0.2
		c7.5-1.1,11.9-8.1,12.6-15.2c0.4-4.5,0.1-9.4-1.5-13.6c-1.2-3.1-3.5-4.9-5.2-7.6c-1.8-2.8,0.5-7.5,0.9-10.4c0.6-4.7-1-8.2-2.2-9.9"
		/>
	<path class="st3" d="M187.1,528.5c0.5-3.9,1.7-9.9,6.3-11c2.1-0.5,4.5-0.1,6.4,0.7c2.4,1,4.7,2.7,6.8,4.1c2,1.3,4.2,3.3,6.7,3.3
		c2.6,0,3.8-2.6,3.6-4.9c-0.5-4.9-5.6-6.1-9.3-7.8c-1.8-0.9-3.8-1.3-5.6-2.1c-5.5-2.3-8.8-7-9-11.7c-0.3-7.2,3.9-14.3,8.6-15.5"/>
	<path class="st3" d="M189,541.9c1.8,2.1,5.4,3,9.4,3c5.9,0,16.3,0,23.2,0c6.7,0,13.4-4.5,16.2-11.3c4-9.7-2.6-19.8-10.4-24.4
		c-2.7-1.6-9.2-3.7-8.9-7.7c0.1-1.5,1.2-3,2.6-3.7c1.7-0.9,3.5-0.3,5,0.6c2.3,1.4,4.1,3.6,6.6,4.6c2.7,1,4.9-0.4,6-2.9
		c1.5-3.2,1.7-7.6-0.4-10.5c-2.5-3.4-4-5.2-7.5-6.8"/>
	<circle class="st3" cx="46.3" cy="501.3" r="5.5"/>
	<circle class="st3" cx="45.9" cy="522.8" r="5.5"/>
	<path class="st3" d="M39.4,484.3c6.5-0.6,12.2-0.8,18.1,0.2"/>
	<line class="st3" x1="116.8" y1="485.9" x2="124.4" y2="485.9"/>
</g>
</svg>
