<?xml version="1.0" encoding="UTF-8" standalone="no"?>
<svg width="27px" height="28px" viewBox="0 0 27 28" version="1.1" xmlns="http://www.w3.org/2000/svg" xmlns:xlink="http://www.w3.org/1999/xlink" xmlns:sketch="http://www.bohemiancoding.com/sketch/ns">
    <!-- Generator: Sketch 3.3.3 (12081) - http://www.bohemiancoding.com/sketch -->
    <title>close-invert</title>
    <desc>Created with Sketch.</desc>
    <defs></defs>
    <g id="Page-1" stroke="none" stroke-width="1" fill="none" fill-rule="evenodd" sketch:type="MSPage">
        <g id="Artboard-9" sketch:type="MSArtboardGroup" transform="translate(-313.000000, -746.000000)" fill="#F6F6F6">
            <path d="M326.918525,758.585786 L338.585786,746.918525 L340,748.332738 L328.332738,760 L340,771.667262 L338.585786,773.081475 L326.918525,761.414214 L315.251263,773.081475 L313.837049,771.667262 L325.504311,760 L313.837049,748.332738 L315.251263,746.918525 L326.918525,758.585786 Z" id="close-invert" sketch:type="MSShapeGroup"></path>
        </g>
    </g>
</svg>