<?xml version="1.0" encoding="UTF-8" standalone="no"?>
<svg width="28px" height="4px" viewBox="0 0 28 4" version="1.1" xmlns="http://www.w3.org/2000/svg" xmlns:xlink="http://www.w3.org/1999/xlink" xmlns:sketch="http://www.bohemiancoding.com/sketch/ns">
    <!-- Generator: Sketch 3.3.3 (12081) - http://www.bohemiancoding.com/sketch -->
    <title>Path Copy + Path Copy 2</title>
    <desc>Created with Sketch.</desc>
    <defs></defs>
    <g id="Page-1" stroke="none" stroke-width="1" fill="none" fill-rule="evenodd" sketch:type="MSPage">
        <g id="project-images" sketch:type="MSArtboardGroup" transform="translate(-277.000000, -560.000000)" fill="#000000">
            <g id="Path-Copy-+-Path-Copy-2" sketch:type="MSLayerGroup" transform="translate(277.000000, 560.000000)">
                <path d="M14,3.61188524 C13.8687072,3.60686428 13.7687078,3.59290261 13.7,3.57 L13.436,3.504 C13.4066665,3.504 13.3040009,3.51866652 13.128,3.548 C12.9959993,3.57733348 12.8420009,3.57733348 12.666,3.548 C12.5046659,3.48933304 12.0793368,3.46 11.39,3.46 C10.9499978,3.44533326 10.6200011,3.43066674 10.4,3.416 C10.1799989,3.40133326 10.0626667,3.394 10.048,3.394 C9.94533282,3.394 9.7106685,3.41599978 9.344,3.46 C9.0506652,3.50400022 8.65466916,3.54066652 8.156,3.57 C7.81866498,3.57 7.51066806,3.54066696 7.232,3.482 C7.05599912,3.43799978 6.92400044,3.416 6.836,3.416 C6.77733304,3.416 6.68200066,3.42333326 6.55,3.438 C6.43266608,3.45266674 6.31900055,3.46 6.209,3.46 C6.09899945,3.46 5.9706674,3.45266674 5.824,3.438 C5.54533194,3.40866652 5.37666696,3.37933348 5.318,3.35 C5.27399978,3.33533326 5.15666762,3.328 4.966,3.328 C4.80466586,3.328 4.65800066,3.34999978 4.526,3.394 C4.40866608,3.45266696 4.21066806,3.482 3.932,3.482 C3.7853326,3.482 3.47733568,3.47466674 3.008,3.46 C2.14266234,3.44533326 1.62933414,3.41600022 1.468,3.372 C1.36533282,3.34266652 1.19666784,3.328 0.962,3.328 C0.8886663,3.34266674 0.7786674,3.35 0.632,3.35 C0.4853326,3.35 0.34600066,3.34266674 0.214,3.328 C0.135238606,3.32441994 0.0639053019,3.3195291 2.27949604e-13,3.31332747 L2.2759572e-13,3.31332747 L1.18294263e-13,1.05096965 C0.120918725,1.04365653 0.272918424,1.04 0.456,1.04 C0.80800176,1.04 1.04999934,1.01800022 1.182,0.974 C1.24066696,0.94466652 1.35799912,0.93 1.534,0.93 C1.6806674,0.95933348 1.7906663,0.974 1.864,0.974 C1.90800022,0.98866674 2.01066586,0.98133348 2.172,0.952 C2.27466718,0.90799978 2.35533304,0.886 2.414,0.886 C2.45800022,0.886 2.50933304,0.89333326 2.568,0.908 C2.7146674,0.93733348 2.84666608,0.94466674 2.964,0.93 C3.08133392,0.91533326 3.19866608,0.92999978 3.316,0.974 C3.41866718,1.01800022 3.49933304,1.03266674 3.558,1.018 C3.57266674,1.018 3.64599934,0.99600022 3.778,0.952 C3.83666696,0.93733326 3.96866564,0.93 4.174,0.93 C4.3206674,0.93 4.45266608,0.94466652 4.57,0.974 C4.67266718,1.03266696 4.78266608,1.04733348 4.9,1.018 C4.92933348,1.018 4.96966641,1.01433337 5.021,1.007 C5.07233359,0.99966663 5.13099967,0.98866674 5.197,0.974 C5.26300033,0.95933326 5.31066652,0.952 5.34,0.952 C5.51600088,0.92266652 5.70666564,0.92999978 5.912,0.974 C6.26400176,1.01800022 6.45466652,1.04 6.484,1.04 C6.61600066,1.04 6.76999912,1.02533348 6.946,0.996 C7.06333392,0.95199978 7.28333172,0.95199978 7.606,0.996 C7.95800176,1.02533348 8.33199802,1.04 8.728,1.04 L9.982,1.04 C10.3486685,1.04 10.5979993,1.01800022 10.73,0.974 C10.8473339,0.94466652 10.9646661,0.93 11.082,0.93 C11.1993339,0.93 11.3166661,0.94466652 11.434,0.974 C11.5953341,1.01800022 11.9179976,1.04 12.402,1.04 L14,1.04 L14,3.61188524 Z" id="Path-Copy" sketch:type="MSShapeGroup"></path>
                <path d="M28,3.61188524 C27.8687072,3.60686428 27.7687078,3.59290261 27.7,3.57 L27.436,3.504 C27.4066665,3.504 27.3040009,3.51866652 27.128,3.548 C26.9959993,3.57733348 26.8420009,3.57733348 26.666,3.548 C26.5046659,3.48933304 26.0793368,3.46 25.39,3.46 C24.9499978,3.44533326 24.6200011,3.43066674 24.4,3.416 C24.1799989,3.40133326 24.0626667,3.394 24.048,3.394 C23.9453328,3.394 23.7106685,3.41599978 23.344,3.46 C23.0506652,3.50400022 22.6546692,3.54066652 22.156,3.57 C21.818665,3.57 21.5106681,3.54066696 21.232,3.482 C21.0559991,3.43799978 20.9240004,3.416 20.836,3.416 C20.777333,3.416 20.6820007,3.42333326 20.55,3.438 C20.4326661,3.45266674 20.3190006,3.46 20.209,3.46 C20.0989995,3.46 19.9706674,3.45266674 19.824,3.438 C19.5453319,3.40866652 19.376667,3.37933348 19.318,3.35 C19.2739998,3.33533326 19.1566676,3.328 18.966,3.328 C18.8046659,3.328 18.6580007,3.34999978 18.526,3.394 C18.4086661,3.45266696 18.2106681,3.482 17.932,3.482 C17.7853326,3.482 17.4773357,3.47466674 17.008,3.46 C16.1426623,3.44533326 15.6293341,3.41600022 15.468,3.372 C15.3653328,3.34266652 15.1966678,3.328 14.962,3.328 C14.8886663,3.34266674 14.7786674,3.35 14.632,3.35 C14.4853326,3.35 14.3460007,3.34266674 14.214,3.328 C14.1352386,3.32441994 14.0639053,3.3195291 14,3.31332747 L14,3.31332747 L14,1.05096965 C14.1209187,1.04365653 14.2729184,1.04 14.456,1.04 C14.8080018,1.04 15.0499993,1.01800022 15.182,0.974 C15.240667,0.94466652 15.3579991,0.93 15.534,0.93 C15.6806674,0.95933348 15.7906663,0.974 15.864,0.974 C15.9080002,0.98866674 16.0106659,0.98133348 16.172,0.952 C16.2746672,0.90799978 16.355333,0.886 16.414,0.886 C16.4580002,0.886 16.509333,0.89333326 16.568,0.908 C16.7146674,0.93733348 16.8466661,0.94466674 16.964,0.93 C17.0813339,0.91533326 17.1986661,0.92999978 17.316,0.974 C17.4186672,1.01800022 17.499333,1.03266674 17.558,1.018 C17.5726667,1.018 17.6459993,0.99600022 17.778,0.952 C17.836667,0.93733326 17.9686656,0.93 18.174,0.93 C18.3206674,0.93 18.4526661,0.94466652 18.57,0.974 C18.6726672,1.03266696 18.7826661,1.04733348 18.9,1.018 C18.9293335,1.018 18.9696664,1.01433337 19.021,1.007 C19.0723336,0.99966663 19.1309997,0.98866674 19.197,0.974 C19.2630003,0.95933326 19.3106665,0.952 19.34,0.952 C19.5160009,0.92266652 19.7066656,0.92999978 19.912,0.974 C20.2640018,1.01800022 20.4546665,1.04 20.484,1.04 C20.6160007,1.04 20.7699991,1.02533348 20.946,0.996 C21.0633339,0.95199978 21.2833317,0.95199978 21.606,0.996 C21.9580018,1.02533348 22.331998,1.04 22.728,1.04 L23.982,1.04 C24.3486685,1.04 24.5979993,1.01800022 24.73,0.974 C24.8473339,0.94466652 24.9646661,0.93 25.082,0.93 C25.1993339,0.93 25.3166661,0.94466652 25.434,0.974 C25.5953341,1.01800022 25.9179976,1.04 26.402,1.04 L28,1.04 L28,3.61188524 Z" id="Path-Copy-2" sketch:type="MSShapeGroup" transform="translate(21.000000, 2.248943) scale(1, -1) rotate(-180.000000) translate(-21.000000, -2.248943) "></path>
            </g>
        </g>
    </g>
</svg>