<?xml version="1.0" encoding="utf-8"?>
<!-- Generator: Adobe Illustrator 23.0.1, SVG Export Plug-In . SVG Version: 6.00 Build 0)  -->
<svg version="1.1" id="Layer_1" xmlns="http://www.w3.org/2000/svg" xmlns:xlink="http://www.w3.org/1999/xlink" x="0px" y="0px"
	 viewBox="0 0 197.5 212.2" style="enable-background:new 0 0 197.5 212.2;" xml:space="preserve">
<style type="text/css">
	.st0{fill:#FFFFFF;}
</style>
<title>Asset 10</title>
<g>
	<path class="st0" d="M0,0h197.5v0c0,17.7-14.4,32.1-32.1,32.1H0V0z"/>
	<rect y="120.1" class="st0" width="197.5" height="32.1"/>
	<rect y="60" class="st0" width="35.8" height="92.2"/>
	<path class="st0" d="M175.6,92.1h21.9v120.1h-35.8V106C161.7,98.3,168,92.1,175.6,92.1z"/>
	<path class="st0" d="M197.5,212.2H0v0c0-17.7,14.4-32.1,32.1-32.1h165.4V212.2z"/>
	<path class="st0" d="M91.8,92.1H0V60h91.8c3.8,0,6.9,3.1,6.9,6.9v18.2C98.8,89,95.7,92.1,91.8,92.1z"/>
</g>
</svg>
