%YAML 1.1
%TAG !u! tag:unity3d.com,2011:
--- !u!21 &2100000
Material:
  serializedVersion: 6
  m_ObjectHideFlags: 0
  m_CorrespondingSourceObject: {fileID: 0}
  m_PrefabInternal: {fileID: 0}
  m_Name: GrassMaterial
  m_Shader: {fileID: 4800000, guid: f94b026773540a04096c6edadd9b96ae, type: 3}
  m_ShaderKeywords: ETC1_EXTERNAL_ALPHA
  m_LightmapFlags: 4
  m_EnableInstancingVariants: 1
  m_DoubleSidedGI: 0
  m_CustomRenderQueue: -1
  stringTagMap: {}
  disabledShaderPasses: []
  m_SavedProperties:
    serializedVersion: 3
    m_TexEnvs:
    - _BumpMap:
        m_Texture: {fileID: 0}
        m_Scale: {x: 1, y: 1}
        m_Offset: {x: 0, y: 0}
    - _Cube:
        m_Texture: {fileID: 0}
        m_Scale: {x: 1, y: 1}
        m_Offset: {x: 0, y: 0}
    - _DetailAlbedoMap:
        m_Texture: {fileID: 0}
        m_Scale: {x: 1, y: 1}
        m_Offset: {x: 0, y: 0}
    - _DetailMask:
        m_Texture: {fileID: 0}
        m_Scale: {x: 1, y: 1}
        m_Offset: {x: 0, y: 0}
    - _DetailNormalMap:
        m_Texture: {fileID: 0}
        m_Scale: {x: 1, y: 1}
        m_Offset: {x: 0, y: 0}
    - _EmissionMap:
        m_Texture: {fileID: 0}
        m_Scale: {x: 1, y: 1}
        m_Offset: {x: 0, y: 0}
    - _MainTex:
        m_Texture: {fileID: 2800000, guid: 908af5d89a113a54f9008f5eb4ec9b55, type: 3}
        m_Scale: {x: 1, y: 1}
        m_Offset: {x: 0, y: 0}
    - _MetallicGlossMap:
        m_Texture: {fileID: 0}
        m_Scale: {x: 1, y: 1}
        m_Offset: {x: 0, y: 0}
    - _OcclusionMap:
        m_Texture: {fileID: 0}
        m_Scale: {x: 1, y: 1}
        m_Offset: {x: 0, y: 0}
    - _ParallaxMap:
        m_Texture: {fileID: 0}
        m_Scale: {x: 1, y: 1}
        m_Offset: {x: 0, y: 0}
    - _RampTex:
        m_Texture: {fileID: 2800000, guid: 65eed2614bab86a448a6ebbc9fa8e414, type: 3}
        m_Scale: {x: 1, y: 1}
        m_Offset: {x: 0, y: 0}
    - _WindTex:
        m_Texture: {fileID: 2800000, guid: 5a69c52b1566ca24e833ecb71cca768a, type: 3}
        m_Scale: {x: 1, y: 1}
        m_Offset: {x: 0, y: 0}
    m_Floats:
    - _BumpScale: 1
    - _Cutoff: 0
    - _DetailNormalMapScale: 1
    - _DstBlend: 0
    - _GlossMapScale: 1
    - _Glossiness: 0.5
    - _GlossyReflections: 1
    - _HeightCutoff: 0
    - _HeightFactor: 10
    - _Metallic: 0
    - _MinY: -5
    - _Mode: 0
    - _OcclusionStrength: 1
    - _Parallax: 0.02
    - _RimPower: 3
    - _Scale: 3
    - _ScaleX: 100
    - _ScaleY: 100
    - _ShakeBending: 0.455
    - _ShakeDisplacement: 0.167
    - _ShakeTime: 0.4
    - _ShakeWindspeed: 0
    - _SmoothnessTextureChannel: 0
    - _SpecularHighlights: 1
    - _Speed: 2
    - _SrcBlend: 1
    - _UVSec: 0
    - _WaveAmp: 10
    - _WaveSpeed: 10
    - _WindSpeed: 23.73
    - _WorldScale: 10
    - _WorldSize: 0.83
    - _ZWrite: 1
    - _xScale: -1
    - _yScale: 1
    m_Colors:
    - _Color: {r: 0, g: 1, b: 0.046749115, a: 1}
    - _ColorTint: {r: 0.49163148, g: 0.7075472, b: 0.19023673, a: 1}
    - _EmissionColor: {r: 0, g: 0, b: 0, a: 1}
    - _MainColor: {r: 1, g: 1, b: 1, a: 0}
    - _RimColor: {r: 0.26, g: 0.19, b: 0.16, a: 0}
    - _WindSpeed: {r: 25.5, g: 0, b: 0, a: 0}
    - _WorldSize: {r: 100, g: 0, b: 1, a: 0}
