%YAML 1.1
%TAG !u! tag:unity3d.com,2011:
--- !u!78 &1
TagManager:
  serializedVersion: 2
  tags:
  - Block
  - Shelter
  - Interface
  - Point
  - Ground
  - Enemy
  - Pause
  - SparksGun
  - LightGun
  - CanvasOnGameOver
  - Allocation
  - Data
  - DestroyableIcon
  - Shooter
  - Electric
  - Kamikaze
  - Decoration
  - Tank
  - Fire
  - Dish
  - Tree
  - PlayerPart
  - InterfaceObject
  - InterfaceButton
  - WayPoint
  - Detail
  - Part
  layers:
  - Default
  - TransparentFX
  - Ignore Raycast
  - 
  - Water
  - UI
  - 
  - 
  - 
  - 
  - 
  - 
  - 
  - 
  - 
  - 
  - 
  - 
  - 
  - 
  - 
  - 
  - 
  - 
  - 
  - 
  - 
  - 
  - 
  - 
  - 
  - 
  m_SortingLayers:
  - name: Default
    uniqueID: 0
    locked: 0
