<?xml version="1.0" encoding="utf-8"?>
<COLLADA xmlns="http://www.collada.org/2005/11/COLLADASchema" version="1.4.1">
  <asset>
    <contributor>
      <author>Blender User</author>
      <authoring_tool>Blender 2.78.0 commit date:2017-02-24, commit time:14:33, hash:e92f235283</authoring_tool>
    </contributor>
    <created>2017-04-25T23:52:44</created>
    <modified>2017-04-25T23:52:44</modified>
    <unit name="meter" meter="1"/>
    <up_axis>Z_UP</up_axis>
  </asset>
  <library_images/>
  <library_effects>
    <effect id="MusicPlayer-effect">
      <profile_COMMON>
        <technique sid="common">
          <phong>
            <emission>
              <color sid="emission">0 0 0 1</color>
            </emission>
            <ambient>
              <color sid="ambient">0 0 0 1</color>
            </ambient>
            <diffuse>
              <color sid="diffuse">0.64 0.64 0.64 1</color>
            </diffuse>
            <specular>
              <color sid="specular">0.5 0.5 0.5 1</color>
            </specular>
            <shininess>
              <float sid="shininess">50</float>
            </shininess>
            <index_of_refraction>
              <float sid="index_of_refraction">1</float>
            </index_of_refraction>
          </phong>
        </technique>
      </profile_COMMON>
    </effect>
  </library_effects>
  <library_materials>
    <material id="MusicPlayer-material" name="MusicPlayer">
      <instance_effect url="#MusicPlayer-effect"/>
    </material>
  </library_materials>
  <library_geometries>
    <geometry id="Cube-mesh" name="Cube">
      <mesh>
        <source id="Cube-mesh-positions">
          <float_array id="Cube-mesh-positions-array" count="255">0.7022123 0.4058143 -0.4058143 -0.702212 0.4058144 -0.4058143 0.7022126 0.4058141 0.4058143 -0.7022123 0.4058143 0.4058143 0.5941796 0.4058143 -0.4448434 -0.5941794 0.4058144 -0.4448434 0.5941799 0.4058141 0.4448434 -0.5941796 0.4058143 0.4448434 0.7556265 0.4058142 -0.2705429 0.7556267 0.4058141 0.2705429 -0.7556262 0.4058144 -0.2705429 -0.7556265 0.4058143 0.2705429 0.5941793 -0.05426973 0.2705429 0.5941795 -0.05426961 -0.2705429 -0.59418 -0.05426943 0.2705429 -0.5941799 -0.05426943 -0.2705429 -0.5941799 -0.08297777 -0.4448434 -0.7022125 -0.08297777 -0.4058143 0.7556262 -0.08297806 0.2705429 0.7022119 -0.08297812 0.4058143 -0.7556269 -0.08297771 0.2705429 -0.7022127 -0.08297771 0.4058143 -0.5941801 -0.08297777 0.4448434 -0.5941799 -0.08297777 -0.4058142 -0.7022125 -0.08297777 -0.2705429 0.7022123 -0.08297789 -0.4058143 0.5941796 -0.08297789 -0.4448434 0.7022122 -0.08297795 -0.2705429 0.5941796 -0.08297789 -0.4058144 0.7556264 -0.08297795 -0.2705429 0.5941792 -0.08297812 0.4058144 0.7022119 -0.08297806 0.2705429 0.5941792 -0.08297812 0.4448434 -0.5941801 -0.08297777 0.4058142 -0.7022127 -0.08297777 0.2705429 -0.7556267 -0.08297777 -0.2705429 0.19806 0.4058142 0.4448434 1.247106 -0.02421414 0.2705429 -1.24714 -0.02421385 -0.2705429 -1.24714 -0.02421379 0.2705429 1.247106 -0.02421402 -0.2705429 0.8116365 -0.08297806 0.3557357 0.8116371 0.4058141 0.3557357 -0.8115941 -0.08297771 0.3557357 -0.8115938 0.4058143 0.3557357 1.247106 -0.08297806 0.4211871 1.247107 0.4058141 0.4211871 -1.24714 -0.08297771 0.4211871 -1.247139 0.4058143 0.4211871 -0.8115934 0.4058144 -0.3808621 -0.811594 -0.08297777 -0.3808621 0.8116369 0.4058142 -0.3808621 0.8116368 -0.08297795 -0.3808621 -1.247138 0.4058144 -0.4465339 -1.24714 -0.08297777 -0.4465339 1.247106 0.4058142 -0.4465339 1.247106 -0.08297795 -0.4465339 1.391146 0.4058142 -0.2705429 1.391146 0.4058141 0.2705429 -1.392982 0.4058144 -0.2705429 -1.392983 0.4058143 0.2705429 1.391145 -0.08297806 0.2705429 -1.392983 -0.08297777 -0.2705429 -1.392984 -0.08297771 0.2705429 1.391145 -0.08297795 -0.2705429 1.361597 -0.08297806 0.3557357 1.361598 0.4058141 0.3557357 -1.361631 -0.08297771 0.3557357 -1.361631 0.4058143 0.3557357 -1.36163 0.4058144 -0.3808621 -1.361631 -0.08297777 -0.3808621 1.361598 0.4058142 -0.3808621 1.361598 -0.08297795 -0.3808621 -0.9023558 -0.02421379 0.2705429 -0.9023557 -0.02421385 -0.2705429 -0.9023558 -0.08297771 0.4211871 -0.9023554 0.4058143 0.4211871 -0.9023557 -0.08297777 -0.4465339 -0.902355 0.4058144 -0.4465339 0.8964583 -0.02421402 -0.2705429 0.896458 -0.02421414 0.2705429 0.896458 -0.08297806 0.4211871 0.8964588 0.4058141 0.4211871 0.8964583 -0.08297795 -0.4465339 0.8964584 0.4058142 -0.4465339</float_array>
          <technique_common>
            <accessor source="#Cube-mesh-positions-array" count="85" stride="3">
              <param name="X" type="float"/>
              <param name="Y" type="float"/>
              <param name="Z" type="float"/>
            </accessor>
          </technique_common>
        </source>
        <source id="Cube-mesh-normals">
          <float_array id="Cube-mesh-normals-array" count="423">0.930114 -8.38467e-7 0.3672708 0.3397778 0 -0.9405058 -0.930114 8.38467e-7 0.367271 -0.3397778 3.31751e-7 0.9405058 0.2568245 -0.9664581 0 -0.2515863 -0.9467488 0.2009257 0.3397777 -4.64451e-7 0.9405059 -0.2568243 -0.9664582 -3.23356e-7 0.2515864 -0.9467487 -0.2009264 0.9301139 0 -0.3672714 -0.2515872 -0.9467484 -0.2009265 -0.930114 8.38467e-7 -0.367271 0 -1 0 0 -1 -2.94504e-7 -2.75864e-7 -1 -5.09834e-7 -5.51727e-7 -1 2.54917e-7 0 -1 0 0.2515869 -0.9467486 0.2009263 -0.3397783 3.31751e-7 -0.9405056 1.50471e-7 1 1.89975e-7 0 -1 0 -2.75864e-7 -1 0 -1.47983e-7 -0.978213 0.2076039 0 0 -1 -2.50785e-7 -1 0 0 -0.9316281 -0.3634133 0 0 1 -2.38029e-7 -0.978213 -0.207604 0 -1 0 -0.4962968 4.62326e-7 0.868153 -0.3758261 -0.921207 0.1006606 0 -1 -2.74885e-7 0 -0.9485211 0.3167141 0.2381554 -0.9212295 0.3076012 0.8357801 -2.99078e-7 0.5490643 0 1 0 -0.2535088 -0.9011945 -0.3515419 -0.2034087 -0.9121515 -0.3558154 -0.8355862 8.97027e-7 0.5493595 0.4962961 -1.38698e-6 0.8681533 0 0 -1 0.373727 -0.9275388 2.62718e-7 0.8918007 -9.85762e-7 -0.4524287 -0.8916599 2.46402e-7 -0.452706 1 -2.25367e-6 4.40629e-7 -1 3.15513e-6 -1.5422e-6 -0.9384674 1.00747e-6 0.345368 0.9447876 -2.02851e-6 0.3276836 0.9659528 -5.33864e-7 -0.2587189 -0.9619092 2.12652e-6 -0.2733696 -0.4975544 1.15486e-6 -0.8674328 0.1787399 -0.9332466 0.3116135 -0.3777452 -0.9259096 -4.20442e-7 0.4975547 0 -0.8674326 0.3702425 -0.9188881 -0.1362544 0 -1 -2.57791e-7 0.5862046 -6.80309e-7 -0.8101631 0 -0.9316281 -0.3634132 0.5849106 -5.44875e-7 0.8110978 -0.3653432 -0.9122342 0.1853463 -0.371785 -0.9283189 0 -0.6121932 0 -0.7907084 -0.610906 9.95909e-7 0.7917032 0 -0.9485212 0.3167139 0.3850842 -0.9228815 0 0.3733054 -0.8946545 -0.2454313 0.9301139 -1.2577e-6 0.3672716 0.3397781 0 -0.9405056 -0.930114 6.2885e-7 0.3672708 -0.3397781 1.99051e-7 0.9405058 0.2568237 -0.9664583 1.61441e-7 0.3397777 -5.30802e-7 0.9405058 -0.256824 -0.9664583 -4.42338e-7 0.9301142 -2.09617e-7 -0.3672705 -0.9301139 8.38467e-7 -0.3672713 -5.57949e-7 -1 0 0 -1 -3.06619e-7 0 -1 -5.1558e-7 -2.75864e-7 -1 0 -5.57948e-7 -1 2.57791e-7 -5.51729e-7 -1 0 -0.3397778 3.31751e-7 -0.9405058 0 1 1.18933e-6 1.50471e-7 1 6.47465e-7 0 1 0 0 1 0 0 1 0 -1.44658e-7 1 0 1.22323e-7 1 2.46272e-7 0 1 1.40127e-7 0 1 1.70579e-7 0 -1 0 -2.75864e-7 -1 0 0 -0.9782131 0.2076035 0 0 -1 -1.50471e-7 -1 -2.02465e-7 -2.24955e-7 -0.978213 -0.2076041 0 -1 0 -0.4962968 6.9349e-7 0.868153 -0.1787399 -0.9332466 0.3116136 0 -1 -2.76837e-7 0 -0.9485211 0.3167138 0.3779285 -0.9057332 0.1918787 0.8357801 -8.97235e-7 0.5490643 0 1 5.64192e-7 0 1 1.20734e-7 0 1 -1.31192e-6 0 1 -2.66459e-7 0 1 3.46669e-7 -0.3611683 -0.9018099 -0.2372689 -0.3745443 -0.918064 -0.1299044 -0.8355861 1.19604e-6 0.5493597 0.4962966 -6.93489e-7 0.868153 0.3737275 -0.9275386 2.68023e-7 0.8918005 -9.85762e-7 -0.4524291 -0.8916599 2.46402e-7 -0.4527058 0 1 -9.15506e-7 0 1 -1.76192e-7 0 1 1.72835e-7 0 1 2.65691e-7 1 -4.50733e-7 -8.8126e-7 -1 9.01467e-7 -4.4063e-7 -0.9384669 1.00747e-6 0.3453692 0.9447875 -2.02852e-6 0.3276838 0.9659528 -1.06773e-6 -0.2587187 -0.9619094 2.12652e-6 -0.2733686 -0.4975547 1.15486e-6 -0.8674327 0.3716374 -0.9223507 0.1056174 -0.3777442 -0.9259101 -4.25804e-7 0.497554 -4.61942e-7 -0.8674331 0.2034087 -0.9121515 -0.3558154 0 -1 -2.66584e-7 0.5862038 -8.16371e-7 -0.8101637 0 -0.931628 -0.3634133 0.5849106 -4.08656e-7 0.8110978 -0.2233722 -0.9245551 0.3087117 -0.3717852 -0.9283189 0 -0.6121935 2.84188e-7 -0.790708 -0.6109068 5.69091e-7 0.7917026 0.385084 -0.9228816 0 0.2700077 -0.8970255 -0.3499159</float_array>
          <technique_common>
            <accessor source="#Cube-mesh-normals-array" count="141" stride="3">
              <param name="X" type="float"/>
              <param name="Y" type="float"/>
              <param name="Z" type="float"/>
            </accessor>
          </technique_common>
        </source>
        <source id="Cube-mesh-map-0">
          <float_array id="Cube-mesh-map-0-array" count="996">0.8705138 0.3163204 0.9163161 0.1581602 0.9163162 0.3163205 0.7163641 0 0.5622145 0.03698754 0.5622145 0 0.9068211 0.4744807 0.8705138 0.6326408 0.8705138 0.4744807 0.5622146 0.4405134 0.7163642 0.4775176 0.5622146 0.4775177 0.3361561 0.258483 0.5067144 0.2235149 0.5067913 0.2584814 0.5067913 0.6430027 0.5493732 0.6429923 0.5067144 0.6779491 0.5622144 0.8498135 0.7163641 0.8804992 0.5622144 0.8804994 0.5067913 0.6430027 0.3360792 0.6779506 0.3361561 0.6430042 0.3361561 0.258483 0.2934205 0.2584733 0.3360792 0.2235164 0.9419143 0.4744807 0.9068211 0.632641 0.906821 0.4744808 0.3361561 0.6430042 0.3360792 0.6779506 0.2934204 0.6429945 0.8705138 0.3163205 0.9161737 0.4744807 0.8705138 0.4744807 0.3360792 0.2235164 0.5067144 0.2062315 0.5067144 0.2235149 0.5493732 0.6429923 0.5493732 0.6779487 0.5067144 0.6779491 0.2934204 0.6429945 0.3360792 0.6779506 0.2934204 0.677951 0.2934205 0.2584733 0.2934205 0.2235168 0.3360792 0.2235164 0.5067144 0.2235149 0.5493732 0.2235145 0.5493732 0.258471 0.5067913 0.2584814 0.5067144 0.2235149 0.5493732 0.258471 0.7163641 0.4097296 0.5622144 0.4405132 0.5622144 0.4097295 0 0.3860511 0.2805792 0.6423987 0 0.6423988 0.5493732 0.258471 0.5616813 0.6429921 0.5493732 0.6429923 0.2811124 0.2584735 0.2934204 0.6429945 0.2811124 0.6429947 0.5493732 0.258471 0.5067913 0.6430027 0.5067913 0.2584814 0.7163641 0.03698754 0.5622144 0.4097295 0.5622145 0.03698754 0.5067913 0.2584814 0.3361561 0.6430042 0.3361561 0.258483 0.3362366 0.8542842 0.2885726 0.740804 0.3362367 0.740824 0.7163642 0.4775176 0.7163641 0.8498133 0.5622145 0.7257149 0.3361561 0.6430042 0.2934205 0.2584733 0.3361561 0.258483 0.3362367 0.158776 0.5068718 0.04721164 0.5068718 0.1587744 0.7564867 0.8418398 0.7163642 0.9999999 0.7163642 0.8418397 0.5068718 0.8542826 0.5415043 0.8913082 0.5067144 0.9008694 0.5068718 0.7408224 0.3362366 0.8542842 0.3362367 0.740824 0.5068718 0.04721164 0.5622144 0.1587534 0.5068718 0.1587744 0.5068718 0.7408224 0.5415043 0.7133557 0.5622144 0.7408015 0.923401 0.6836796 0.8923169 0.8418397 0.8923169 0.6836796 0.2256102 1.54292e-7 0.05496889 0.2056372 0.05496883 0 0.8617635 0.8418399 0.7564868 0.9999999 0.7564867 0.8418398 0.8705137 0.6273649 0.7163642 0.5175123 0.8705137 0.517512 0.3362367 0.158776 0.3092131 0.1881238 0.2885726 0.1587559 0.3362366 0.8542842 0.3092131 0.8913103 0.2885726 0.8542641 0.8705138 0.6836793 0.7163642 0.6592364 0.8705138 0.6592362 0.8705137 0.517512 0.7163642 0.4856563 0.8705138 0.4856562 0.8945971 0.8418398 0.9999998 1 0.8945969 1 0.8636477 0.8418397 0.7564522 0.6836796 0.8636478 0.6836796 0.3362367 0.04721313 0.5067144 0 0.5068718 0.04721164 0.9435501 0.4744806 0.9161738 0.3163205 0.9435501 0.3163205 0.8705139 0 0.9088411 0.1581602 0.8705138 0.1581602 0.05496895 0.6946387 0.05496901 0.9008703 0.007460534 0.7421163 0.7163642 0.2904803 0.8705138 0.4564807 0.7163642 0.4564808 0.8705138 0.06780827 0.7163642 0.2360078 0.7163642 0.06780827 0.7163642 0.2360078 0.8705138 0.2596742 0.7163642 0.2596743 0.7163642 0.4564808 0.8705138 0.4856562 0.7163642 0.4856563 0.7163642 0.2904803 0.8705138 0.2596742 0.8705138 0.2904802 0.7163642 0.06780827 0.8705138 0.03069871 0.8705138 0.06780827 0.8705137 0 0.7163642 0.03069871 0.7163642 0 0.5068718 0.04721164 0.5415044 0.01014435 0.5622144 0.04719066 0.5068718 0.8542826 0.3360792 0.9008709 0.3362366 0.8542842 0.7564521 0.8418397 0.7163643 0.6836796 0.7564522 0.6836796 0.3362367 0.04721313 0.3092131 0.01014643 0.3360792 1.54292e-6 0.3360792 0.6952341 0.5067144 0.6779491 0.5067144 0.6952325 0.8617635 0.8418399 0.8945969 1 0.8617635 1 0.3362367 0.158776 0.2885726 0.04719305 0.3362367 0.04721313 0.8923169 0.6836796 0.8636478 0.8418397 0.8636477 0.6836796 0.5068718 0.1587744 0.5415044 0.1881217 0.5067144 0.2062315 0.3360792 0.206233 0.5068718 0.1587744 0.5067144 0.2062315 0.9088412 0 0.9361639 0.1581602 0.9088411 0.1581602 0.8705138 0.6592362 0.7163642 0.6273652 0.8705137 0.6273649 0.5068718 0.7408224 0.5622144 0.8542616 0.5068718 0.8542826 0.5067144 0.6952325 0.3362367 0.740824 0.3360792 0.6952341 0.3362367 0.740824 0.3092131 0.7133578 0.3360792 0.6952341 0.8705138 0.3163204 0.8705138 0.1581602 0.9163161 0.1581602 0.7163641 0 0.7163641 0.03698754 0.5622145 0.03698754 0.9068211 0.4744807 0.9068211 0.6326409 0.8705138 0.6326408 0.5622146 0.4405134 0.7163642 0.4405133 0.7163642 0.4775176 0.3361561 0.258483 0.3360792 0.2235164 0.5067144 0.2235149 0.5622144 0.8498135 0.7163641 0.8498133 0.7163641 0.8804992 0.5067913 0.6430027 0.5067144 0.6779491 0.3360792 0.6779506 0.9419143 0.4744807 0.9419143 0.6326409 0.9068211 0.632641 0.8705138 0.3163205 0.9161737 0.3163205 0.9161737 0.4744807 0.3360792 0.2235164 0.3360792 0.206233 0.5067144 0.2062315 0.5067144 0.6952325 0.5067144 0.6779491 0.5493732 0.6779487 0.5493732 0.6429923 0.5616813 0.6429921 0.5493732 0.6779487 0.3360792 0.6952341 0.2934204 0.677951 0.3360792 0.6779506 0.2811124 0.6429947 0.2934204 0.6429945 0.2934204 0.677951 0.3360792 0.206233 0.3360792 0.2235164 0.2934205 0.2235168 0.2934205 0.2584733 0.2811124 0.2584735 0.2934205 0.2235168 0.5616813 0.2584708 0.5493732 0.258471 0.5493732 0.2235145 0.5067144 0.2235149 0.5067144 0.2062315 0.5493732 0.2235145 0.7163641 0.4097296 0.716364 0.4405134 0.5622144 0.4405132 0.01230859 0.6773554 0 0.6423988 0.05496895 0.6946387 0 0.3860511 0 0.2578772 0.05496889 0.2056372 0.01230853 0.2229206 0.05496889 0.2056372 0 0.2578772 0.2256102 0.2056373 0.2682706 0.2229207 0.2805792 0.2578772 0.2805792 0.2578772 0.2805792 0.6423987 0 0.3860511 0.2682707 0.6773552 0.2256103 0.6946386 0.2805792 0.6423987 0.05496895 0.6946387 0 0.6423988 0.2805792 0.6423987 0 0.3860511 0.05496889 0.2056372 0.2256102 0.2056373 0.2256102 0.2056373 0.2805792 0.2578772 0 0.3860511 0.2256103 0.6946386 0.05496895 0.6946387 0.2805792 0.6423987 0.5493732 0.258471 0.5616813 0.2584708 0.5616813 0.6429921 0.2811124 0.2584735 0.2934205 0.2584733 0.2934204 0.6429945 0.5493732 0.258471 0.5493732 0.6429923 0.5067913 0.6430027 0.7163641 0.03698754 0.7163641 0.4097296 0.5622144 0.4097295 0.5067913 0.2584814 0.5067913 0.6430027 0.3361561 0.6430042 0.3362366 0.8542842 0.2885726 0.8542641 0.2885726 0.740804 0.5622144 0.8498135 0.5622145 0.7257149 0.7163641 0.8498133 0.5622146 0.4775177 0.7163642 0.4775176 0.5622145 0.7257149 0.3361561 0.6430042 0.2934204 0.6429945 0.2934205 0.2584733 0.3362367 0.158776 0.3362367 0.04721313 0.5068718 0.04721164 0.7564867 0.8418398 0.7564868 0.9999999 0.7163642 0.9999999 0.5068718 0.8542826 0.5622144 0.8542616 0.5415043 0.8913082 0.5068718 0.7408224 0.5068718 0.8542826 0.3362366 0.8542842 0.5068718 0.04721164 0.5622144 0.04719066 0.5622144 0.1587534 0.5068718 0.7408224 0.5067144 0.6952325 0.5415043 0.7133557 0.923401 0.6836796 0.923401 0.8418397 0.8923169 0.8418397 0.007460474 0.1600677 0.007460415 0.04660737 0.05496889 0.2056372 0.02810174 0.009560883 0.05496883 0 0.007460415 0.04660737 0.2256102 1.54292e-7 0.2604014 0.009561002 0.2811122 0.04660743 0.2811122 0.04660743 0.2811123 0.1600678 0.2256102 0.2056373 0.2604014 0.1875138 0.2256102 0.2056373 0.2811123 0.1600678 0.05496889 0.2056372 0.02810174 0.1875138 0.007460474 0.1600677 0.007460415 0.04660737 0.05496883 0 0.05496889 0.2056372 0.2256102 1.54292e-7 0.2811122 0.04660743 0.2256102 0.2056373 0.2256102 0.2056373 0.05496889 0.2056372 0.2256102 1.54292e-7 0.8617635 0.8418399 0.8617635 1 0.7564868 0.9999999 0.8705137 0.6273649 0.7163642 0.6273652 0.7163642 0.5175123 0.3362367 0.158776 0.3360792 0.206233 0.3092131 0.1881238 0.3362366 0.8542842 0.3360792 0.9008709 0.3092131 0.8913103 0.8705138 0.6836793 0.7163642 0.6836796 0.7163642 0.6592364 0.8705137 0.517512 0.7163642 0.517512 0.7163642 0.4856563 0.8945971 0.8418398 1 0.8418397 0.9999998 1 0.8636477 0.8418397 0.7564521 0.8418397 0.7564522 0.6836796 0.3362367 0.04721313 0.3360792 1.54292e-6 0.5067144 0 0.9435501 0.4744806 0.9161737 0.4744807 0.9161738 0.3163205 0.8705139 0 0.9088412 0 0.9088411 0.1581602 0.02810186 0.8907257 0.007460594 0.8536792 0.05496901 0.9008703 0.007460534 0.7421163 0.02810186 0.7127482 0.05496895 0.6946387 0.05496895 0.6946387 0.2256103 0.6946386 0.2256103 0.9008701 0.2604016 0.7127481 0.2811123 0.7421161 0.2256103 0.6946386 0.2811124 0.853679 0.2604016 0.8907254 0.2256103 0.9008701 0.2256103 0.9008701 0.05496901 0.9008703 0.05496895 0.6946387 0.007460594 0.8536792 0.007460534 0.7421163 0.05496901 0.9008703 0.2256103 0.6946386 0.2811123 0.7421161 0.2256103 0.9008701 0.2811124 0.853679 0.2256103 0.9008701 0.2811123 0.7421161 0.7163642 0.2904803 0.8705138 0.2904802 0.8705138 0.4564807 0.8705138 0.06780827 0.8705138 0.2360078 0.7163642 0.2360078 0.7163642 0.2360078 0.8705138 0.2360078 0.8705138 0.2596742 0.7163642 0.4564808 0.8705138 0.4564807 0.8705138 0.4856562 0.7163642 0.2904803 0.7163642 0.2596743 0.8705138 0.2596742 0.7163642 0.06780827 0.7163642 0.03069871 0.8705138 0.03069871 0.8705137 0 0.8705138 0.03069871 0.7163642 0.03069871 0.5068718 0.04721164 0.5067144 0 0.5415044 0.01014435 0.5068718 0.8542826 0.5067144 0.9008694 0.3360792 0.9008709 0.7564521 0.8418397 0.7163642 0.8418397 0.7163643 0.6836796 0.3362367 0.04721313 0.2885726 0.04719305 0.3092131 0.01014643 0.3360792 0.6952341 0.3360792 0.6779506 0.5067144 0.6779491 0.8617635 0.8418399 0.8945971 0.8418398 0.8945969 1 0.3362367 0.158776 0.2885726 0.1587559 0.2885726 0.04719305 0.8923169 0.6836796 0.8923169 0.8418397 0.8636478 0.8418397 0.5068718 0.1587744 0.5622144 0.1587534 0.5415044 0.1881217 0.3360792 0.206233 0.3362367 0.158776 0.5068718 0.1587744 0.9088412 0 0.9361639 0 0.9361639 0.1581602 0.8705138 0.6592362 0.7163642 0.6592364 0.7163642 0.6273652 0.5068718 0.7408224 0.5622144 0.7408015 0.5622144 0.8542616 0.5067144 0.6952325 0.5068718 0.7408224 0.3362367 0.740824 0.3362367 0.740824 0.2885726 0.740804 0.3092131 0.7133578</float_array>
          <technique_common>
            <accessor source="#Cube-mesh-map-0-array" count="498" stride="2">
              <param name="S" type="float"/>
              <param name="T" type="float"/>
            </accessor>
          </technique_common>
        </source>
        <vertices id="Cube-mesh-vertices">
          <input semantic="POSITION" source="#Cube-mesh-positions"/>
        </vertices>
        <polylist material="MusicPlayer-material" count="166">
          <input semantic="VERTEX" source="#Cube-mesh-vertices" offset="0"/>
          <input semantic="NORMAL" source="#Cube-mesh-normals" offset="1"/>
          <input semantic="TEXCOORD" source="#Cube-mesh-map-0" offset="2" set="0"/>
          <vcount>3 3 3 3 3 3 3 3 3 3 3 3 3 3 3 3 3 3 3 3 3 3 3 3 3 3 3 3 3 3 3 3 3 3 3 3 3 3 3 3 3 3 3 3 3 3 3 3 3 3 3 3 3 3 3 3 3 3 3 3 3 3 3 3 3 3 3 3 3 3 3 3 3 3 3 3 3 3 3 3 3 3 3 3 3 3 3 3 3 3 3 3 3 3 3 3 3 3 3 3 3 3 3 3 3 3 3 3 3 3 3 3 3 3 3 3 3 3 3 3 3 3 3 3 3 3 3 3 3 3 3 3 3 3 3 3 3 3 3 3 3 3 3 3 3 3 3 3 3 3 3 3 3 3 3 3 3 3 3 3 3 3 3 3 3 3 </vcount>
          <p>2 0 0 18 0 1 9 0 2 25 1 3 4 1 4 0 1 5 11 2 6 21 2 7 3 2 8 3 3 9 22 3 10 7 3 11 14 4 12 24 4 13 15 4 14 13 5 15 28 5 16 27 5 17 6 6 18 19 6 19 2 6 20 13 7 21 31 7 22 12 7 23 14 8 24 33 8 25 34 8 26 8 9 27 25 9 28 0 9 29 12 10 30 31 10 31 30 10 32 17 11 33 10 11 34 1 11 35 34 12 36 35 12 37 24 12 38 28 13 39 25 13 40 27 13 41 30 14 42 31 14 43 19 14 44 33 15 45 21 15 46 34 15 47 24 16 48 17 16 49 23 16 50 15 17 51 24 17 52 23 17 53 16 18 54 1 18 55 5 18 56 36 19 57 5 19 58 7 19 59 23 20 60 26 20 61 28 20 62 22 21 63 30 21 64 32 21 65 23 22 66 13 22 67 15 22 68 26 23 69 5 23 70 4 23 71 15 24 72 12 24 73 14 24 74 37 25 75 81 25 76 80 25 77 22 26 78 32 26 79 36 26 80 12 27 81 33 27 82 14 27 83 73 28 84 38 28 85 74 28 86 47 29 87 68 29 88 67 29 89 40 30 90 72 30 91 64 30 92 79 31 93 37 31 94 80 31 95 38 32 96 77 32 97 74 32 98 79 33 99 52 33 100 83 33 101 20 34 102 44 34 103 43 34 104 57 35 105 9 35 106 58 35 107 75 26 108 48 26 109 47 26 110 82 26 111 45 26 112 46 26 113 73 36 114 43 36 115 75 36 116 37 37 117 65 37 118 45 37 119 9 38 120 41 38 121 42 38 122 46 39 123 65 39 124 66 39 125 77 40 126 53 40 127 78 40 128 84 40 129 56 40 130 83 40 131 39 41 132 62 41 133 38 41 134 35 42 135 49 42 136 10 42 137 8 43 138 52 43 139 29 43 140 11 35 141 60 35 142 76 35 143 64 44 144 58 44 145 61 44 146 62 45 147 60 45 148 59 45 149 60 46 150 67 46 151 68 46 152 61 47 153 66 47 154 65 47 155 64 48 156 71 48 157 57 48 158 59 49 159 70 49 160 62 49 161 54 50 162 69 50 163 53 50 164 38 51 165 70 51 166 54 51 167 40 52 168 61 52 169 37 52 170 55 53 171 72 53 172 56 53 173 39 54 174 67 54 175 63 54 176 18 55 177 27 55 178 29 55 179 50 56 180 78 56 181 49 56 182 73 57 183 47 57 184 39 57 185 43 58 186 76 58 187 75 58 188 74 59 189 50 59 190 35 59 191 20 60 192 74 60 193 35 60 194 51 61 195 83 61 196 52 61 197 42 62 198 81 62 199 82 62 200 79 63 201 56 63 202 40 63 203 29 64 204 80 64 205 18 64 206 80 65 207 41 65 208 18 65 209 2 66 210 19 66 211 18 66 212 25 67 213 26 67 214 4 67 215 11 68 216 20 68 217 21 68 218 3 69 219 21 69 220 22 69 221 14 70 222 34 70 223 24 70 224 6 71 225 32 71 226 19 71 227 13 72 228 27 72 229 31 72 230 8 73 231 29 73 232 25 73 233 17 74 234 35 74 235 10 74 236 34 75 237 20 75 238 35 75 239 29 76 240 27 76 241 25 76 242 28 16 243 26 16 244 25 16 245 18 77 246 19 77 247 31 77 248 32 78 249 30 78 250 19 78 251 20 79 252 34 79 253 21 79 254 33 80 255 22 80 256 21 80 257 16 16 258 23 16 259 17 16 260 24 16 261 35 16 262 17 16 263 16 81 264 17 81 265 1 81 266 3 82 267 7 82 268 11 82 269 36 83 270 6 83 271 9 83 272 2 84 273 9 84 274 6 84 275 8 85 276 0 85 277 4 85 278 4 86 279 5 86 280 36 86 281 1 84 282 10 84 283 5 84 284 11 87 285 7 87 286 5 87 287 36 88 288 9 88 289 8 88 290 8 89 291 4 89 292 36 89 293 10 90 294 11 90 295 5 90 296 23 91 297 16 91 298 26 91 299 22 92 300 33 92 301 30 92 302 23 93 303 28 93 304 13 93 305 26 94 306 16 94 307 5 94 308 15 95 309 13 95 310 12 95 311 37 25 312 45 25 313 81 25 314 6 26 315 36 26 316 32 26 317 7 26 318 22 26 319 36 26 320 12 96 321 30 96 322 33 96 323 73 97 324 39 97 325 38 97 326 47 98 327 48 98 328 68 98 329 40 99 330 56 99 331 72 99 332 79 100 333 40 100 334 37 100 335 38 101 336 54 101 337 77 101 338 79 102 339 29 102 340 52 102 341 20 103 342 11 103 343 44 103 344 82 104 345 46 104 346 9 104 347 66 35 348 58 35 349 46 35 350 57 35 351 71 35 352 55 35 353 55 105 354 84 105 355 8 105 356 51 106 357 8 106 358 84 106 359 9 35 360 42 35 361 82 35 362 46 35 363 58 35 364 9 35 365 57 107 366 55 107 367 8 107 368 8 108 369 9 108 370 57 108 371 75 26 372 76 26 373 48 26 374 82 26 375 81 26 376 45 26 377 73 109 378 20 109 379 43 109 380 37 110 381 61 110 382 65 110 383 9 111 384 18 111 385 41 111 386 46 112 387 45 112 388 65 112 389 77 40 390 54 40 391 53 40 392 84 40 393 55 40 394 56 40 395 39 113 396 63 113 397 62 113 398 35 114 399 50 114 400 49 114 401 8 115 402 51 115 403 52 115 404 68 35 405 48 35 406 60 35 407 76 116 408 44 116 409 11 116 410 11 35 411 10 35 412 59 35 413 49 35 414 78 35 415 10 35 416 53 117 417 69 117 418 59 117 419 59 118 420 60 118 421 11 118 422 48 35 423 76 35 424 60 35 425 10 119 426 78 119 427 59 119 428 53 35 429 59 35 430 78 35 431 64 120 432 57 120 433 58 120 434 62 121 435 63 121 436 60 121 437 60 122 438 63 122 439 67 122 440 61 123 441 58 123 442 66 123 443 64 124 444 72 124 445 71 124 446 59 125 447 69 125 448 70 125 449 54 126 450 70 126 451 69 126 452 38 127 453 62 127 454 70 127 455 40 128 456 64 128 457 61 128 458 55 129 459 71 129 460 72 129 461 39 130 462 47 130 463 67 130 464 18 131 465 31 131 466 27 131 467 50 132 468 77 132 469 78 132 470 73 133 471 75 133 472 47 133 473 43 134 474 44 134 475 76 134 476 74 135 477 77 135 478 50 135 479 20 136 480 73 136 481 74 136 482 51 137 483 84 137 484 83 137 485 42 138 486 41 138 487 81 138 488 79 63 489 83 63 490 56 63 491 29 139 492 79 139 493 80 139 494 80 140 495 81 140 496 41 140 497</p>
        </polylist>
      </mesh>
    </geometry>
  </library_geometries>
  <library_controllers/>
  <library_visual_scenes>
    <visual_scene id="Scene" name="Scene">
      <node id="MusicPlayer" name="MusicPlayer" type="NODE">
        <matrix sid="transform">1 0 0 0 0 1 0 -0.1468315 0 0 1 0.4526418 0 0 0 1</matrix>
        <instance_geometry url="#Cube-mesh" name="MusicPlayer">
          <bind_material>
            <technique_common>
              <instance_material symbol="MusicPlayer-material" target="#MusicPlayer-material"/>
            </technique_common>
          </bind_material>
        </instance_geometry>
      </node>
    </visual_scene>
  </library_visual_scenes>
  <scene>
    <instance_visual_scene url="#Scene"/>
  </scene>
</COLLADA>