<?xml version="1.0" encoding="utf-8"?>
<COLLADA xmlns="http://www.collada.org/2005/11/COLLADASchema" version="1.4.1">
  <asset>
    <contributor>
      <author>Blender User</author>
      <authoring_tool>Blender 2.78.0 commit date:2017-02-24, commit time:14:33, hash:e92f235283</authoring_tool>
    </contributor>
    <created>2017-04-17T18:37:21</created>
    <modified>2017-04-17T18:37:21</modified>
    <unit name="meter" meter="1"/>
    <up_axis>Z_UP</up_axis>
  </asset>
  <library_images/>
  <library_effects>
    <effect id="Storage2-effect">
      <profile_COMMON>
        <technique sid="common">
          <phong>
            <emission>
              <color sid="emission">0 0 0 1</color>
            </emission>
            <ambient>
              <color sid="ambient">0 0 0 1</color>
            </ambient>
            <diffuse>
              <color sid="diffuse">0.64 0.64 0.64 1</color>
            </diffuse>
            <specular>
              <color sid="specular">0.5 0.5 0.5 1</color>
            </specular>
            <shininess>
              <float sid="shininess">50</float>
            </shininess>
            <index_of_refraction>
              <float sid="index_of_refraction">1</float>
            </index_of_refraction>
          </phong>
        </technique>
      </profile_COMMON>
    </effect>
    <effect id="Storage2Terrain-effect">
      <profile_COMMON>
        <technique sid="common">
          <phong>
            <emission>
              <color sid="emission">0 0 0 1</color>
            </emission>
            <ambient>
              <color sid="ambient">0 0 0 1</color>
            </ambient>
            <diffuse>
              <color sid="diffuse">0.64 0.64 0.64 1</color>
            </diffuse>
            <specular>
              <color sid="specular">0.5 0.5 0.5 1</color>
            </specular>
            <shininess>
              <float sid="shininess">50</float>
            </shininess>
            <index_of_refraction>
              <float sid="index_of_refraction">1</float>
            </index_of_refraction>
          </phong>
        </technique>
      </profile_COMMON>
    </effect>
  </library_effects>
  <library_materials>
    <material id="Storage2-material" name="Storage2">
      <instance_effect url="#Storage2-effect"/>
    </material>
    <material id="Storage2Terrain-material" name="Storage2Terrain">
      <instance_effect url="#Storage2Terrain-effect"/>
    </material>
  </library_materials>
  <library_geometries>
    <geometry id="Grid-mesh" name="Grid">
      <mesh>
        <source id="Grid-mesh-positions">
          <float_array id="Grid-mesh-positions-array" count="240">-0.5555556 -0.5555556 0 -0.3333333 -0.3333333 0 -0.7853503 0.1188391 0 -0.1187102 0.1129003 0 -0.7833707 0.3410524 0 -0.1167306 0.3351137 0 -0.7813912 0.5632658 0 -0.114751 0.5573271 0 -0.7794116 0.7854792 0 -0.1127714 0.7795405 0 -0.1167306 0.3351137 0.4225198 -0.7833707 0.3410524 0.4225198 -0.1187102 0.1129003 0.2459148 -0.7853503 0.1188391 0.2459148 -0.1127714 0.7795405 0.2459148 -0.7794116 0.7854792 0.2459148 -0.2222222 -0.4444444 0.1196798 -0.3333333 -0.5 0 -0.1111111 -0.5 0 -0.2222222 -0.5 0.1196798 -0.3333333 -0.2777777 0 -0.1111111 -0.2777777 0 -0.114751 0.5573271 0.4225198 -0.1111111 -0.3888889 0.1196798 -0.1111111 -0.3888889 0.0616998 -0.3333333 -0.5 0.0616998 -0.1111111 -0.5 0.0616998 -0.2222222 -0.5 0.0616998 -0.2222222 -0.4444444 0.0616998 -0.2777777 -0.4444444 0.0616998 -0.3333333 -0.2777777 0.0616998 -0.7813912 0.5632658 0.4225198 -0.1666666 -0.5 0.0616998 -0.2777777 -0.2777777 0.0616998 -0.1666666 -0.3888889 0.0616998 -0.1111111 -0.2777777 0.1196798 -0.2777777 -0.4444444 0.1196798 -0.1666666 -0.5 0.1196798 -0.2777777 -0.2777777 0.1196798 -0.1666666 -0.3888889 0.1196798 -0.4444444 -0.5555556 0 -0.5555556 -0.4444444 0 -0.3333333 -0.4166666 0 -0.4444444 -0.6666667 0 -0.7222222 -0.5555556 0 -0.3333333 -0.375 0 -0.5555556 -0.7222222 0 -0.3333333 -0.4583333 0 -0.7222222 -0.4444444 0 -0.5 -0.6666667 0 -0.7222222 -0.7222222 0 -0.5 -0.7222222 0 -0.5555556 -0.6111112 0.05283701 -0.5 -0.5555556 0.05283701 -0.5555556 -0.7222222 0.05283701 -0.6666667 -0.5555556 0.05283701 -0.5555556 -0.5 0.05283701 -0.5555556 -0.4444444 0.05283701 -0.6666667 -0.5 0.05283701 -0.4444444 -0.5555556 0.05283701 -0.5 -0.6666667 0.05283701 -0.7222222 -0.5555556 0.05283701 -0.7222222 -0.4444444 0.05283701 -0.4444444 -0.6666667 0.05283701 -0.5 -0.7222222 0.05283701 -0.5 -0.6111112 0.05283701 -0.5555556 -0.6111112 0.1118091 -0.5555556 -0.5555556 0.1118091 -0.5 -0.5555556 0.1118091 -0.5555556 -0.7222222 0.1118091 -0.5555556 -0.6666667 0.1118091 -0.6666667 -0.5555556 0.1118091 -0.6666667 -0.6666667 0.1118091 -0.7222222 -0.5555556 0.1118091 -0.7222222 -0.7222222 0.1118091 -0.5 -0.6111112 0.1118091 -0.6666667 -0.6666667 0.1646565 -0.5555556 -0.6666667 0.1646565 -0.5555556 -0.5 0.1646565 -0.6666667 -0.5 0.1646565</float_array>
          <technique_common>
            <accessor source="#Grid-mesh-positions-array" count="80" stride="3">
              <param name="X" type="float"/>
              <param name="Y" type="float"/>
              <param name="Z" type="float"/>
            </accessor>
          </technique_common>
        </source>
        <source id="Grid-mesh-normals">
          <float_array id="Grid-mesh-normals-array" count="81">-0.9999604 0.008908271 0 -0.008908152 -0.9999604 0 0.9999604 -0.008908152 0 0.008908033 0.9999604 0 -0.9999604 0.008908331 0 -0.9999604 0.008907973 0 0.005542337 0.6221475 0.7828805 -0.005542397 -0.6221478 0.7828802 0 0 1 0.9999604 -0.008908092 0 0.9999604 -0.008908152 0 -1 0 0 0 1 0 0 -1 0 1 0 0 1 0 0 1 -1.19935e-6 0 -0.008908152 -0.9999604 0 0.008908033 0.9999604 0 -0.9999604 0.008907973 0 -0.9999604 0.008908331 0 0.005542337 0.6221478 0.7828802 -0.005542397 -0.6221477 0.7828803 0 0 1 0.9999604 -0.008908092 0 0.9999604 -0.008908092 0 -1 1.19935e-6 0</float_array>
          <technique_common>
            <accessor source="#Grid-mesh-normals-array" count="27" stride="3">
              <param name="X" type="float"/>
              <param name="Y" type="float"/>
              <param name="Z" type="float"/>
            </accessor>
          </technique_common>
        </source>
        <source id="Grid-mesh-map-0">
          <float_array id="Grid-mesh-map-0-array" count="768">0.3356794 0.8322504 0 0.6658018 0.3356794 0.6658018 0.4852837 0.001318037 0.6806558 0.5006557 0.4852838 0.5006557 0.4852837 0.6671038 0.820963 0.8335519 0.4852838 0.833552 0.121555 0 0 0.4993532 0 0 0.3356794 0.6658018 0.1403073 0.4993533 0.3356794 0.4993532 0.3356794 0.8322504 0.1403073 0.9986988 0 0.8322504 0.347067 0.4993532 0.121555 0 0.3470671 0 0.6806557 0.001318037 0.8209631 0.4993374 0.6806558 0.5006557 0.4852837 0.4993532 0.3470671 0 0.4852837 0 0.9558554 0.5191698 0.9999916 0.5841438 0.9558555 0.5843271 0.4852838 0.833552 0.6806558 1 0.4852839 1 0.4852837 0.6671038 0.6806557 0.5006557 0.820963 0.6671038 0.4797801 0.8497962 0.4307614 0.8810056 0.4797801 0.8185868 0.8650997 0.1573328 0.997722 0.1860858 0.8211758 0.1860858 0.8655562 0.05959784 0.9098449 0.0270195 0.9096928 0.05959779 0.9160451 0.7686626 0.8670265 0.7270499 0.8670265 0.6854372 0.9160451 0.7270493 0.9621085 0.6022117 0.9621085 0.7270493 0.9097921 0.5189865 0.9558554 0.6022117 0.9097921 0.6022117 0.3356794 0.8810058 0.3817427 0.7977806 0.4307614 0.8810058 0.9539293 0.9345028 0.9980663 0.891074 0.9980663 0.9345027 0.8670265 0.7270499 0.8209631 0.6854372 0.8670265 0.6854372 0.9534772 0.06515663 0.8648998 0.1303133 0.9094929 0.03257834 0.9539293 0.891074 0.9097921 0.9345027 0.9097921 0.8910741 0.4680909 0.8810057 0.4239537 0.9244345 0.4239537 0.8810058 0.9580226 0.768662 0.9160451 0.7270493 0.9580226 0.7270493 1 0.7686619 0.9580226 0.7270493 1 0.7270494 0.9097921 0.8389699 0.9539287 0.8389165 0.9541694 0.866398 0.3359652 0.7145554 0.4681496 0.6897273 0.4683747 0.7143498 0.3799718 0.6572858 0.3359307 0.6247758 0.3800671 0.6247074 0.3798166 0.8810057 0.3356794 0.9251776 0.3356794 0.8810057 0.8209632 0.6022116 0.8678147 0.477374 0.9097921 0.6022117 0.3359307 0.6247758 0.3798158 0.5972259 0.3800671 0.6247074 0.4239537 0.8810057 0.3798166 0.9251776 0.3798166 0.8810057 0.9542772 0.8338196 0.9985216 0.8011876 0.9983059 0.8663446 0.8629406 0.8102754 0.8209631 0.8102755 0.8629406 0.7686627 0.3800064 0.5320688 0.3356794 0.5972943 0.3359653 0.4995589 0.9540365 0.806338 0.9097921 0.8389699 0.9099 0.8063915 0.9517778 0.3525366 0.9937552 0.2693114 0.9937553 0.3525366 0.9097921 0.2693111 0.8629406 0.2276985 0.9517778 0.2276985 0.3794954 0.6051771 0.4682448 0.6571488 0.3799718 0.6572858 0.9097921 0.3941488 0.9517778 0.4357614 0.9097922 0.5189865 0.9937635 0.2693114 0.9517778 0.1860859 0.9937635 0.1860858 0.4677683 0.60504 0.3797812 0.5074415 0.4680542 0.5073044 0.3356794 0.8322504 0 0.8322504 0 0.6658018 0.4852837 0.001318037 0.6806557 0.001318037 0.6806558 0.5006557 0.4852837 0.6671038 0.820963 0.6671038 0.820963 0.8335519 0.121555 0 0.1215551 0.4993532 0 0.4993532 0.3356794 0.6658018 0 0.6658018 0.1403073 0.4993533 0.3356794 0.8322504 0.3356794 0.9986988 0.1403073 0.9986988 0.347067 0.4993532 0.1215551 0.4993532 0.121555 0 0.6806557 0.001318037 0.820963 0 0.8209631 0.4993374 0.4852837 0.4993532 0.347067 0.4993532 0.3470671 0 0.9558554 0.5191698 0.9999916 0.5189865 0.9999916 0.5841438 0.4852838 0.833552 0.820963 0.8335519 0.6806558 1 0.4852837 0.6671038 0.4852837 0.5006557 0.6806557 0.5006557 0.4307614 0.7145554 0.4797801 0.7145554 0.4797801 0.756168 0.4797801 0.7873774 0.4797801 0.8185868 0.4307614 0.8810056 0.4307614 0.7145554 0.4797801 0.756168 0.4797801 0.7873774 0.4797801 0.8810057 0.4307614 0.8810056 0.4797801 0.8497962 0.4307614 0.7145554 0.4797801 0.7873774 0.4307614 0.8810056 0.8650997 0.1573328 0.8648998 0.1303133 0.9973095 0.1303133 0.9973095 0.1303133 0.997722 0.1860858 0.8650997 0.1573328 0.8211758 0.1860858 0.8209631 0.1573328 0.8650997 0.1573328 0.8655562 0.05959784 0.8650997 0.1573328 0.8209631 0.1573328 0.8215719 0.02701956 0.9098449 0.0270195 0.8655562 0.05959784 0.8655562 0.05959784 0.8209631 0.1573328 0.8215719 0.02701956 0.8670265 0.6022116 0.9160451 0.6022117 0.8670265 0.6854372 0.9160451 0.7686626 0.8670265 0.7686626 0.8670265 0.7270499 0.8670265 0.6854372 0.9160451 0.6022117 0.9160451 0.7686626 0.9160451 0.7270493 0.9160451 0.6022116 0.9621085 0.6022117 0.9097921 0.5189865 0.9558554 0.5189865 0.9558554 0.6022117 0.4307614 0.7145554 0.4307614 0.8810058 0.3817427 0.7977806 0.3356794 0.8810058 0.3356794 0.7977806 0.3817427 0.7977806 0.3817427 0.7977806 0.3817427 0.7145554 0.4307614 0.7145554 0.9539293 0.9345028 0.9539293 0.8910741 0.9980663 0.891074 0.8670265 0.7270499 0.8209631 0.7270499 0.8209631 0.6854372 0.9096451 0 0.9537816 0 0.9094929 0.03257834 0.9534772 0.06515663 0.9976138 0.06515663 0.9973095 0.1303133 0.9973095 0.1303133 0.8648998 0.1303133 0.9534772 0.06515663 0.9094929 0.03257834 0.9537816 0 0.9534772 0.06515663 0.8648998 0.1303133 0.8653563 0.03257834 0.9094929 0.03257834 0.9539293 0.891074 0.9539293 0.9345028 0.9097921 0.9345027 0.4680909 0.8810057 0.4680909 0.9244344 0.4239537 0.9244345 0.9580226 0.768662 0.9160452 0.768662 0.9160451 0.7270493 1 0.7686619 0.9580226 0.7686619 0.9580226 0.7270493 0.9983059 0.8663446 0.9985216 0.8909672 0.9541694 0.866398 0.9102485 0.891074 0.9097921 0.8389699 0.9541694 0.866398 0.9541694 0.866398 0.9985216 0.8909672 0.9102485 0.891074 0.3359652 0.7145554 0.3357401 0.6899329 0.4681496 0.6897273 0.3799718 0.6572858 0.4682448 0.6571488 0.4681496 0.6897273 0.3357401 0.6899329 0.3359307 0.6247758 0.3799718 0.6572858 0.3799718 0.6572858 0.4681496 0.6897273 0.3357401 0.6899329 0.3798166 0.8810057 0.3798166 0.9251776 0.3356794 0.9251776 0.9097921 0.4773739 0.9097921 0.6022117 0.8678147 0.477374 0.8209632 0.6022116 0.8209631 0.477374 0.8678147 0.477374 0.8678147 0.477374 0.8678146 0.3941488 0.9097921 0.3941488 0.9097921 0.3941488 0.9097921 0.4773739 0.8678147 0.477374 0.3359307 0.6247758 0.3356794 0.5972943 0.3798158 0.5972259 0.4239537 0.8810057 0.4239537 0.9251776 0.3798166 0.9251776 0.9542772 0.8338196 0.9101407 0.833873 0.9543851 0.8012411 0.9103564 0.7687161 0.9544929 0.7686626 0.9543851 0.8012411 0.9543851 0.8012411 0.9985216 0.8011876 0.9542772 0.8338196 0.9983059 0.8663446 0.9541694 0.866398 0.9542772 0.8338196 0.9101407 0.833873 0.9103564 0.7687161 0.9543851 0.8012411 0.8629406 0.8102754 0.9097921 0.8102754 0.9097921 0.9351137 0.9097921 0.9351137 0.8209632 0.9351137 0.8629406 0.8102754 0.8209631 0.8102755 0.8209631 0.7686626 0.8629406 0.7686627 0.8629406 0.8102754 0.8209632 0.9351137 0.8209631 0.8102755 0.3359653 0.4995589 0.4683747 0.4993532 0.3800064 0.5320688 0.3800064 0.5320688 0.3798158 0.5972259 0.3356794 0.5972943 0.4683747 0.4993532 0.4682794 0.5319318 0.3800064 0.5320688 0.9540365 0.806338 0.9539287 0.8389165 0.9097921 0.8389699 0.9517778 0.3525366 0.9517778 0.2693114 0.9937552 0.2693114 0.9097921 0.3941488 0.8629406 0.3941488 0.9097921 0.3525363 0.9097921 0.3525363 0.8629406 0.3941488 0.8629406 0.3109236 0.9517778 0.2276985 0.9517778 0.3525363 0.9097921 0.2693111 0.8209632 0.1860859 0.8629406 0.1860858 0.8629406 0.2276985 0.9097921 0.3525363 0.8629406 0.3109236 0.9097921 0.3109237 0.9097921 0.3525363 0.9097921 0.3109237 0.9517778 0.3525363 0.8209631 0.2693111 0.8209632 0.1860859 0.8629406 0.2276985 0.9517778 0.3525363 0.9097921 0.3109237 0.9097921 0.2693111 0.9097921 0.2693111 0.8209631 0.2693111 0.8629406 0.2276985 0.3794954 0.6051771 0.4677683 0.60504 0.4682448 0.6571488 0.9097921 0.3941488 0.9986293 0.3941488 0.9517778 0.4357614 0.9517778 0.4357614 0.9517778 0.5189865 0.9097922 0.5189865 0.9986293 0.3941488 0.9986294 0.4357613 0.9517778 0.4357614 0.9937635 0.2693114 0.9517779 0.2693114 0.9517778 0.1860859 0.4677683 0.60504 0.3794954 0.6051771 0.3797812 0.5074415</float_array>
          <technique_common>
            <accessor source="#Grid-mesh-map-0-array" count="384" stride="2">
              <param name="S" type="float"/>
              <param name="T" type="float"/>
            </accessor>
          </technique_common>
        </source>
        <vertices id="Grid-mesh-vertices">
          <input semantic="POSITION" source="#Grid-mesh-positions"/>
        </vertices>
        <polylist material="Storage2-material" count="128">
          <input semantic="VERTEX" source="#Grid-mesh-vertices" offset="0"/>
          <input semantic="NORMAL" source="#Grid-mesh-normals" offset="1"/>
          <input semantic="TEXCOORD" source="#Grid-mesh-map-0" offset="2" set="0"/>
          <vcount>3 3 3 3 3 3 3 3 3 3 3 3 3 3 3 3 3 3 3 3 3 3 3 3 3 3 3 3 3 3 3 3 3 3 3 3 3 3 3 3 3 3 3 3 3 3 3 3 3 3 3 3 3 3 3 3 3 3 3 3 3 3 3 3 3 3 3 3 3 3 3 3 3 3 3 3 3 3 3 3 3 3 3 3 3 3 3 3 3 3 3 3 3 3 3 3 3 3 3 3 3 3 3 3 3 3 3 3 3 3 3 3 3 3 3 3 3 3 3 3 3 3 3 3 3 3 3 3 </vcount>
          <p>4 0 0 31 0 1 6 0 2 3 1 3 13 1 4 2 1 5 7 2 6 10 2 7 5 2 8 15 3 9 9 3 10 8 3 11 6 4 12 15 4 13 8 4 14 4 5 15 13 5 16 11 5 17 22 6 18 15 6 19 31 6 20 12 7 21 11 7 22 13 7 23 10 8 24 31 8 25 11 8 26 24 8 27 32 8 28 26 8 29 5 9 30 12 9 31 3 9 32 7 10 33 14 10 34 22 10 35 47 11 36 25 11 37 42 11 38 33 12 39 21 12 40 20 12 41 29 8 42 27 8 43 28 8 44 18 13 45 32 13 46 27 13 47 36 11 48 33 11 49 29 11 50 34 14 51 37 14 52 32 14 53 35 15 54 24 15 55 21 15 56 27 11 57 16 11 58 28 11 59 32 13 60 19 13 61 27 13 62 39 8 63 38 8 64 16 8 65 24 13 66 39 13 67 34 13 68 28 13 69 36 13 70 29 13 71 43 13 72 60 13 73 49 13 74 49 14 75 64 14 76 51 14 77 67 12 78 68 12 79 53 12 80 48 12 81 57 12 82 41 12 83 58 8 84 61 8 85 55 8 86 65 13 87 66 13 88 52 13 89 74 11 90 61 11 91 50 11 92 61 12 93 71 12 94 55 12 95 53 14 96 75 14 97 65 14 98 65 8 99 63 8 100 59 8 101 54 13 102 46 13 103 64 13 104 72 8 105 73 8 106 74 8 107 75 8 108 67 8 109 66 8 110 59 14 111 43 14 112 40 14 113 67 16 114 56 16 115 78 16 116 79 12 117 56 12 118 58 12 119 79 11 120 71 11 121 76 11 122 70 13 123 76 13 124 72 13 125 78 8 126 76 8 127 77 8 128 4 0 129 11 0 130 31 0 131 3 17 132 12 17 133 13 17 134 7 2 135 22 2 136 10 2 137 15 18 138 14 18 139 9 18 140 6 19 141 31 19 142 15 19 143 4 20 144 2 20 145 13 20 146 22 21 147 14 21 148 15 21 149 12 22 150 10 22 151 11 22 152 10 23 153 22 23 154 31 23 155 24 8 156 34 8 157 32 8 158 5 24 159 10 24 160 12 24 161 7 25 162 9 25 163 14 25 164 30 11 165 20 11 166 1 11 167 45 11 168 42 11 169 25 11 170 30 11 171 1 11 172 45 11 173 17 11 174 25 11 175 47 11 176 30 11 177 45 11 178 25 11 179 33 12 180 38 12 181 35 12 182 35 12 183 21 12 184 33 12 185 20 12 186 30 12 187 33 12 188 29 8 189 33 8 190 30 8 191 25 8 192 27 8 193 29 8 194 29 8 195 30 8 196 25 8 197 25 13 198 17 13 199 27 13 200 18 13 201 26 13 202 32 13 203 27 13 204 17 13 205 18 13 206 36 11 207 38 11 208 33 11 209 34 14 210 39 14 211 37 14 212 18 14 213 21 14 214 24 14 215 35 14 216 23 14 217 24 14 218 24 14 219 26 14 220 18 14 221 27 11 222 19 11 223 16 11 224 32 13 225 37 13 226 19 13 227 19 8 228 37 8 229 16 8 230 39 8 231 23 8 232 35 8 233 35 8 234 38 8 235 39 8 236 16 8 237 37 8 238 39 8 239 38 8 240 36 8 241 16 8 242 24 13 243 23 13 244 39 13 245 28 13 246 16 13 247 36 13 248 43 13 249 63 13 250 60 13 251 49 14 252 60 14 253 64 14 254 59 12 255 40 12 256 53 12 257 0 12 258 67 12 259 53 12 260 53 12 261 40 12 262 0 12 263 48 12 264 62 12 265 57 12 266 58 8 267 56 8 268 57 8 269 62 8 270 61 8 271 58 8 272 58 8 273 57 8 274 62 8 275 65 13 276 75 13 277 66 13 278 44 11 279 50 11 280 61 11 281 74 11 282 73 11 283 61 11 284 61 11 285 62 11 286 48 11 287 48 11 288 44 11 289 61 11 290 61 12 291 73 12 292 71 12 293 53 14 294 68 14 295 75 14 296 65 8 297 52 8 298 60 8 299 54 8 300 64 8 301 60 8 302 60 8 303 63 8 304 65 8 305 59 8 306 53 8 307 65 8 308 52 8 309 54 8 310 60 8 311 54 13 312 69 13 313 74 13 314 74 13 315 50 13 316 54 13 317 46 13 318 51 13 319 64 13 320 54 13 321 50 13 322 46 13 323 74 8 324 69 8 325 72 8 326 72 8 327 71 8 328 73 8 329 69 8 330 70 8 331 72 8 332 75 8 333 68 8 334 67 8 335 59 14 336 63 14 337 43 14 338 69 14 339 54 14 340 70 14 341 70 14 342 54 14 343 52 14 344 78 14 345 77 14 346 67 14 347 41 14 348 57 14 349 56 14 350 70 14 351 52 14 352 66 14 353 70 14 354 66 14 355 77 14 356 0 14 357 41 14 358 56 14 359 77 14 360 66 14 361 67 14 362 67 14 363 0 14 364 56 14 365 79 12 366 78 12 367 56 12 368 79 26 369 58 26 370 71 26 371 71 11 372 72 11 373 76 11 374 58 11 375 55 11 376 71 11 377 70 13 378 77 13 379 76 13 380 78 8 381 79 8 382 76 8 383</p>
        </polylist>
      </mesh>
    </geometry>
    <geometry id="Grid_001-mesh" name="Grid.001">
      <mesh>
        <source id="Grid_001-mesh-positions">
          <float_array id="Grid_001-mesh-positions-array" count="219">-1 -1 0 0.1936219 -1 0 -0.7777778 -0.7777778 0 -0.5555556 -0.7777778 0 -0.3333333 -0.7777778 0 -0.7777778 -0.5555556 0 -0.5555556 -0.5555556 0 -0.3333333 -0.5555556 0 0.1195479 -0.9259259 0.1807225 -0.7777778 -0.3333333 0 -0.5555556 -0.3333333 0 -0.3333333 -0.3333333 0 -0.7777778 -0.1111111 0 -0.3333333 -0.1111111 0 -0.1111111 -0.1111111 0 -0.7853503 0.1188391 0 0.1936219 -0.9259259 0.1807225 -0.1187102 0.1129003 0 0.1936219 -1 0.1807225 -1 -0.925926 0.1807225 -0.7833707 0.3410524 0 -0.1167306 0.3351137 0 0.1195479 -1 0.1807225 -0.7813912 0.5632658 0 -0.114751 0.5573271 0 -0.925926 1 0.1807225 -0.7794116 0.7854792 0 0.1195479 0.925926 0.1807225 -0.1127714 0.7795405 0 -1 1 0.1807225 0.1936219 1 0.1807225 -1 1 0 0.1936219 1 0 -0.3333333 -0.5 0 -0.1111111 -0.5 0 -0.3333333 -0.2777777 0 -0.1111111 -0.2777777 0 -0.7777778 0.925926 0 0.1195479 1 0.1807225 -0.925926 0.925926 0.1807225 -0.1111111 0.925926 0 -1 0.9259259 0.1807225 -1 -1 0.1807225 0.1195479 0.925926 0 -0.7777778 -0.9259259 0 0.1111111 -0.9259259 0 0.1195479 -0.9259259 0 -0.925926 -0.7777778 0 -0.925926 0.1111111 0 -0.925926 0.7777778 0 -0.925926 0.925926 0 -0.925926 -0.925926 0 -0.4444444 -0.5555556 0 -0.5555556 -0.4444444 0 -0.4444444 -0.3333333 0 -0.3333333 -0.4166666 0 -0.3333333 -0.5277778 0 -0.4444444 -0.6666667 0 -0.7222222 -0.5555556 0 -0.5 -0.3333333 0 -0.3333333 -0.375 0 -0.3333333 -0.5138889 0 -0.5555556 -0.7222222 0 -0.3888889 -0.3333333 0 -0.3333333 -0.4583333 0 -0.3333333 -0.5416667 0 -0.7222222 -0.4444444 0 -0.5 -0.6666667 0 -0.7222222 -0.7222222 0 -0.5 -0.7222222 0 0.1936219 0.925926 0.1807225 -0.925926 -0.925926 0.1807225 -0.9259259 -1 0.1807225</float_array>
          <technique_common>
            <accessor source="#Grid_001-mesh-positions-array" count="73" stride="3">
              <param name="X" type="float"/>
              <param name="Y" type="float"/>
              <param name="Z" type="float"/>
            </accessor>
          </technique_common>
        </source>
        <source id="Grid_001-mesh-normals">
          <float_array id="Grid_001-mesh-normals-array" count="42">0 0 1 1 0 0 0 -1 -6.30935e-7 0 0 1 0 -1 0 -3.39467e-7 0 1 0 1 0 -1 0 0 -1 0 0 0 1 6.30935e-7 0 -1 1.10525e-6 0 1 1.10525e-6 1.57054e-7 0 1 -4.02331e-7 1 0</float_array>
          <technique_common>
            <accessor source="#Grid_001-mesh-normals-array" count="14" stride="3">
              <param name="X" type="float"/>
              <param name="Y" type="float"/>
              <param name="Z" type="float"/>
            </accessor>
          </technique_common>
        </source>
        <source id="Grid_001-mesh-map-0">
          <float_array id="Grid_001-mesh-map-0-array" count="720">0.603046 0.04864531 0.5280213 0.04864537 0.4529966 0 0.6030461 0.1672183 0.6030461 0.1808999 0.5842899 0.1945814 0.4529967 0.1945814 0.4029802 0.3405175 0.4029802 0.04864537 0.6030461 0.2675494 0.6755052 0.3411049 0.4504401 0.343055 0.5655337 0.1945814 0.6030461 0.2675494 0.5467776 0.1945814 0.40298 0.02432262 0.3779719 0.6323895 0.3779718 0.02432262 0.4029803 0.5594215 0.4029802 0.3405175 0.4511085 0.4160201 0 0 0.02500814 0.02432268 0 0.02432268 0.3779719 0.6323895 0.02500832 0.6567122 0.02500832 0.6323896 0.8169578 0.6323896 0.8169578 0.6567122 0.7559439 0.6567122 0.8779718 0 0.9389858 0 0.9389858 0.04864531 0.6030461 0.2675494 0.6780707 0.2128233 0.6780708 0.2675494 0.6470363 0.6080669 0.6470363 0.9513547 0.5860223 0.6838052 0.0250082 0 0.3779718 0.02432262 0.02500814 0.02432268 0.4639942 0.6080669 0.5250082 0.6323896 0.5250082 0.9756774 0.6775103 0.5600003 0.4529968 0.6080669 0.4524452 0.5619503 0.02500832 0.6323896 0 0.6567122 0 0.6323896 0.4029801 0.6323895 0.3779719 0.6567122 0.3779719 0.6323895 0.4524452 0.5619503 0.4029803 0.6080669 0.4029803 0.5594215 0.4029802 0.6080669 0.463994 0.6323896 0.4639942 0.9756773 0.6780707 0.2128233 0.6780707 0.1398553 0.7559438 0 0.4529966 0 0.4029802 0.04864537 0.4029802 0 0.4717528 0.06688743 0.5280213 0.04864537 0.5280213 0.06688737 0.603046 0.04864531 0.5467775 0.06688737 0.5280213 0.04864537 0.4529967 0.1216134 0.4717528 0.1216134 0.4717528 0.1580974 0.02500814 0.02432268 0 0.6323896 0 0.02432268 0.40298 0 0.3779718 0.02432262 0.3779718 0 0.8779718 0.6567122 0.8169579 0.6323896 0.8169579 0.02432262 1 0.6080669 0.938986 0 1 0 0.5250083 0.6567123 0.5860221 0.6080669 0.5860223 0.9513546 0.4529966 0 0.7530954 0 0.603046 0.04864531 0.5280213 0.04864537 0.4529966 0.04864537 0.4529966 0 0.5280213 0.1580974 0.5280213 0.1216134 0.5655337 0.1216134 0.5655337 0.1216134 0.6030461 0.1216133 0.6030461 0.1261738 0.6030461 0.1307343 0.6030461 0.1352948 0.5655337 0.1216134 0.5655337 0.1216134 0.6030461 0.1261738 0.6030461 0.1307343 0.5280214 0.1945814 0.5280213 0.1580974 0.5467776 0.1945814 0.5842899 0.1945814 0.5655337 0.1945814 0.6030461 0.1672183 0.5467776 0.1945814 0.5280213 0.1580974 0.5655337 0.1945814 0.5655337 0.1216134 0.6030461 0.1352948 0.6030461 0.1398553 0.6030461 0.1535369 0.6030461 0.1672183 0.5655337 0.1945814 0.5655337 0.1216134 0.6030461 0.1398553 0.6030461 0.1535369 0.5655337 0.1945814 0.5280213 0.1580974 0.5655337 0.1216134 0.6030461 0.1808999 0.6030461 0.1945814 0.5842899 0.1945814 0.5655337 0.1216134 0.6030461 0.1535369 0.5655337 0.1945814 0.4529966 0.04864537 0.4529967 0.1216134 0.4029802 0.04864537 0.4529967 0.1945814 0.4529967 0.2675495 0.4029802 0.3405175 0.4504401 0.343055 0.4029802 0.3405175 0.4529967 0.2675495 0.4029802 0.04864537 0.4529967 0.1216134 0.4529967 0.1945814 0.4504401 0.343055 0.4529967 0.2675495 0.6030461 0.2675494 0.6030461 0.2675494 0.6780708 0.2675494 0.6755052 0.3411049 0.4529967 0.1945814 0.5280214 0.1945814 0.4529967 0.2675495 0.5655337 0.1945814 0.5842899 0.1945814 0.6030461 0.2128234 0.4529967 0.2675495 0.5280214 0.1945814 0.6030461 0.2675494 0.5842899 0.1945814 0.6030461 0.1945814 0.6030461 0.2128234 0.5280214 0.1945814 0.5467776 0.1945814 0.6030461 0.2675494 0.6030461 0.2128234 0.6030461 0.2675494 0.5655337 0.1945814 0.40298 0.02432262 0.4029801 0.6323895 0.3779719 0.6323895 0.4504401 0.343055 0.4511085 0.4160201 0.4029802 0.3405175 0.4517768 0.4889853 0.4524452 0.5619503 0.4029803 0.5594215 0.4029803 0.5594215 0.4511085 0.4160201 0.4517768 0.4889853 0 0 0.0250082 0 0.02500814 0.02432268 0.3779719 0.6323895 0.3779719 0.6567122 0.02500832 0.6567122 0.7559439 0.6567122 0.755944 0 0.8169578 0.02432262 0.8169578 0.02432262 0.8169578 0.6323896 0.7559439 0.6567122 0.755944 0 0.8169578 0 0.8169578 0.02432262 0.9389858 0.04864531 0.938986 0.3405175 0.8779718 0 0.938986 0.5594215 0.938986 0.6080669 0.8779721 0.6080669 0.8779721 0.6080669 0.8779718 0 0.938986 0.3405175 0.938986 0.3405175 0.938986 0.5594215 0.8779721 0.6080669 0.6030461 0.2675494 0.6030461 0.2128234 0.6780707 0.2128233 0.5860223 0.9027093 0.5860223 0.6838052 0.6470363 0.9513547 0.5860223 0.6080669 0.6470363 0.6080669 0.5860223 0.6838052 0.6470363 0.9513547 0.5860223 0.9513547 0.5860223 0.9027093 0.0250082 0 0.3779718 0 0.3779718 0.02432262 0.5250082 1 0.4639943 1 0.5250082 0.9756774 0.4639942 0.6080669 0.5250082 0.6080669 0.5250082 0.6323896 0.5250082 0.9756774 0.4639943 1 0.4639942 0.6080669 0.6775103 0.5600003 0.6780709 0.6080668 0.4529968 0.6080669 0.02500832 0.6323896 0.02500832 0.6567122 0 0.6567122 0.4029801 0.6323895 0.4029801 0.6567122 0.3779719 0.6567122 0.4524452 0.5619503 0.4529968 0.6080669 0.4029803 0.6080669 0.4639942 1 0.4029803 1 0.4639942 0.9756773 0.4029802 0.6080669 0.463994 0.6080669 0.463994 0.6323896 0.4639942 0.9756773 0.4029803 1 0.4029802 0.6080669 0.6780709 0.6080668 0.6775103 0.5600003 0.7559439 0.6080668 0.6768419 0.4870352 0.6761736 0.41407 0.7559439 0.6080668 0.6761736 0.41407 0.6755052 0.3411049 0.7559439 0.6080668 0.7559439 0.6080668 0.6775103 0.5600003 0.6768419 0.4870352 0.7530954 0 0.7559438 0 0.6780707 0.1398553 0.6030461 0.1216133 0.603046 0.04864531 0.6780707 0.1398553 0.6030461 0.1352948 0.6030461 0.1307343 0.6780707 0.1398553 0.6030461 0.1261738 0.6030461 0.1216133 0.6780707 0.1398553 0.7559438 0 0.7559439 0.6080668 0.6780708 0.2675494 0.7559439 0.6080668 0.6755052 0.3411049 0.6780708 0.2675494 0.6030461 0.1307343 0.6030461 0.1261738 0.6780707 0.1398553 0.6780707 0.1398553 0.6030461 0.1398553 0.6030461 0.1352948 0.7559438 0 0.6780708 0.2675494 0.6780707 0.2128233 0.6780707 0.1398553 0.603046 0.04864531 0.7530954 0 0.4529966 0 0.4529966 0.04864537 0.4029802 0.04864537 0.4717528 0.06688743 0.4717528 0.1216134 0.4529967 0.1216134 0.4529966 0.04864537 0.5280213 0.04864537 0.4717528 0.06688743 0.4717528 0.06688743 0.4529967 0.1216134 0.4529966 0.04864537 0.603046 0.04864531 0.6030461 0.1216133 0.5655337 0.08512938 0.5655337 0.08512938 0.5467776 0.08512938 0.5467775 0.06688737 0.6030461 0.1216133 0.5655337 0.1216134 0.5655337 0.08512938 0.5280213 0.06688737 0.5280213 0.04864537 0.5467775 0.06688737 0.603046 0.04864531 0.5655337 0.08512938 0.5467775 0.06688737 0.4717528 0.1580974 0.5280213 0.1580974 0.5280214 0.1945814 0.4529967 0.1945814 0.4529967 0.1216134 0.4717528 0.1580974 0.4717528 0.1580974 0.5280214 0.1945814 0.4529967 0.1945814 0.02500814 0.02432268 0.02500832 0.6323896 0 0.6323896 0.40298 0 0.40298 0.02432262 0.3779718 0.02432262 0.8169578 0 0.8779718 0 0.8169579 0.02432262 0.8779718 0.6567122 0.8169579 0.6567122 0.8169579 0.6323896 0.8169579 0.02432262 0.8779718 0 0.8779718 0.6567122 1 0.6080669 0.9389861 0.6080669 0.938986 0 0.5860223 0.9513546 0.5250083 0.9513547 0.5250083 0.9485844 0.5250083 0.6567123 0.5250082 0.6080669 0.5860221 0.6080669 0.5860223 0.9513546 0.5250083 0.9485844 0.5250083 0.6567123</float_array>
          <technique_common>
            <accessor source="#Grid_001-mesh-map-0-array" count="360" stride="2">
              <param name="S" type="float"/>
              <param name="T" type="float"/>
            </accessor>
          </technique_common>
        </source>
        <vertices id="Grid_001-mesh-vertices">
          <input semantic="POSITION" source="#Grid_001-mesh-positions"/>
        </vertices>
        <polylist material="Storage2Terrain-material" count="120">
          <input semantic="VERTEX" source="#Grid_001-mesh-vertices" offset="0"/>
          <input semantic="NORMAL" source="#Grid_001-mesh-normals" offset="1"/>
          <input semantic="TEXCOORD" source="#Grid_001-mesh-map-0" offset="2" set="0"/>
          <vcount>3 3 3 3 3 3 3 3 3 3 3 3 3 3 3 3 3 3 3 3 3 3 3 3 3 3 3 3 3 3 3 3 3 3 3 3 3 3 3 3 3 3 3 3 3 3 3 3 3 3 3 3 3 3 3 3 3 3 3 3 3 3 3 3 3 3 3 3 3 3 3 3 3 3 3 3 3 3 3 3 3 3 3 3 3 3 3 3 3 3 3 3 3 3 3 3 3 3 3 3 3 3 3 3 3 3 3 3 3 3 3 3 3 3 3 3 3 3 3 3 </vcount>
          <p>4 0 0 3 0 1 44 0 2 55 0 3 60 0 4 63 0 5 9 0 6 48 0 7 47 0 8 13 0 9 17 0 10 15 0 11 54 0 12 13 0 13 59 0 14 16 0 15 27 0 16 8 0 17 49 0 18 48 0 19 20 0 20 42 0 21 71 0 22 19 0 23 27 0 24 25 0 25 39 0 26 16 1 27 18 1 28 1 1 29 71 1 30 51 1 31 47 1 32 13 0 33 36 0 34 14 0 35 27 2 36 39 2 37 40 2 38 72 3 39 8 3 40 71 3 41 1 4 42 22 4 43 72 4 44 28 0 45 37 0 46 26 0 47 39 5 48 29 5 49 41 5 50 70 0 51 38 0 52 27 0 53 26 0 54 50 0 55 49 0 56 31 6 57 25 6 58 38 6 59 36 0 60 34 0 61 46 0 62 44 0 63 47 0 64 51 0 65 68 0 66 3 0 67 62 0 68 4 0 69 69 0 70 3 0 71 5 0 72 58 0 73 66 0 74 71 0 75 41 0 76 19 0 77 18 0 78 8 0 79 22 0 80 0 7 81 19 7 82 41 7 83 46 8 84 27 8 85 43 8 86 44 9 87 71 9 88 8 9 89 44 0 90 45 0 91 4 0 92 3 0 93 2 0 94 44 0 95 53 0 96 6 0 97 52 0 98 52 0 99 7 0 100 65 0 101 56 0 102 61 0 103 52 0 104 52 0 105 65 0 106 56 0 107 10 0 108 53 0 109 59 0 110 63 0 111 54 0 112 55 0 113 59 0 114 53 0 115 54 0 116 52 0 117 61 0 118 33 0 119 64 0 120 55 0 121 54 0 122 52 0 123 33 0 124 64 0 125 54 0 126 53 0 127 52 0 128 60 0 129 11 0 130 63 0 131 52 0 132 64 0 133 54 0 134 2 0 135 5 0 136 47 0 137 9 0 138 12 0 139 48 0 140 15 0 141 48 0 142 12 0 143 47 0 144 5 0 145 9 0 146 15 0 147 12 0 148 13 0 149 13 0 150 14 0 151 17 0 152 9 0 153 10 0 154 12 0 155 54 0 156 63 0 157 35 0 158 12 0 159 10 0 160 13 0 161 63 0 162 11 0 163 35 0 164 10 0 165 59 0 166 13 0 167 35 0 168 13 0 169 54 0 170 16 0 171 70 0 172 27 0 173 15 0 174 20 0 175 48 0 176 23 0 177 26 0 178 49 0 179 49 0 180 20 0 181 23 0 182 42 0 183 72 0 184 71 0 185 27 0 186 38 0 187 25 0 188 1 1 189 32 1 190 70 1 191 70 1 192 16 1 193 1 1 194 32 1 195 30 1 196 70 1 197 47 1 198 48 1 199 71 1 200 49 1 201 50 1 202 39 1 203 39 1 204 71 1 205 48 1 206 48 1 207 49 1 208 39 1 209 13 0 210 35 0 211 36 0 212 37 4 213 40 4 214 39 4 215 43 4 216 27 4 217 40 4 218 39 4 219 50 4 220 37 4 221 72 0 222 22 0 223 8 0 224 42 4 225 0 4 226 72 4 227 1 4 228 18 4 229 22 4 230 72 10 231 0 10 232 1 10 233 28 0 234 40 0 235 37 0 236 39 0 237 25 0 238 29 0 239 70 0 240 30 0 241 38 0 242 26 0 243 37 0 244 50 0 245 30 6 246 32 6 247 38 6 248 31 6 249 29 6 250 25 6 251 38 11 252 32 11 253 31 11 254 40 0 255 28 0 256 43 0 257 24 0 258 21 0 259 43 0 260 21 0 261 17 0 262 43 0 263 43 0 264 28 0 265 24 0 266 45 0 267 46 0 268 34 0 269 7 0 270 4 0 271 34 0 272 61 0 273 56 0 274 34 0 275 65 0 276 7 0 277 34 0 278 46 0 279 43 0 280 14 0 281 43 0 282 17 0 283 14 0 284 56 0 285 65 0 286 34 0 287 34 0 288 33 0 289 61 0 290 46 0 291 14 0 292 36 0 293 34 0 294 4 0 295 45 0 296 44 0 297 2 0 298 47 0 299 68 0 300 58 0 301 5 0 302 2 0 303 3 0 304 68 0 305 68 0 306 5 0 307 2 0 308 4 0 309 7 0 310 57 0 311 57 0 312 67 0 313 69 0 314 7 0 315 52 0 316 57 0 317 62 0 318 3 0 319 69 0 320 4 0 321 57 0 322 69 0 323 66 0 324 53 0 325 10 0 326 9 0 327 5 0 328 66 0 329 66 0 330 10 0 331 9 0 332 71 12 333 39 12 334 41 12 335 18 0 336 16 0 337 8 0 338 29 7 339 31 7 340 41 7 341 0 7 342 42 7 343 19 7 344 41 7 345 31 7 346 0 7 347 46 8 348 8 8 349 27 8 350 8 6 351 46 6 352 45 6 353 44 13 354 51 13 355 71 13 356 8 6 357 45 6 358 44 6 359</p>
        </polylist>
      </mesh>
    </geometry>
  </library_geometries>
  <library_controllers/>
  <library_visual_scenes>
    <visual_scene id="Scene" name="Scene">
      <node id="Storage2" name="Storage2" type="NODE">
        <matrix sid="transform">2.988319 0 0 0 0 2.988319 0 0 0 0 2.988319 0 0 0 0 1</matrix>
        <instance_geometry url="#Grid-mesh" name="Storage2">
          <bind_material>
            <technique_common>
              <instance_material symbol="Storage2-material" target="#Storage2-material"/>
            </technique_common>
          </bind_material>
        </instance_geometry>
      </node>
      <node id="Storage2Terrain" name="Storage2Terrain" type="NODE">
        <matrix sid="transform">2.988319 0 0 0 0 2.988319 0 0 0 0 2.988319 0.0162809 0 0 0 1</matrix>
        <instance_geometry url="#Grid_001-mesh" name="Storage2Terrain">
          <bind_material>
            <technique_common>
              <instance_material symbol="Storage2Terrain-material" target="#Storage2Terrain-material"/>
            </technique_common>
          </bind_material>
        </instance_geometry>
      </node>
    </visual_scene>
  </library_visual_scenes>
  <scene>
    <instance_visual_scene url="#Scene"/>
  </scene>
</COLLADA>