<?xml version="1.0" encoding="utf-8"?>
<COLLADA xmlns="http://www.collada.org/2005/11/COLLADASchema" version="1.4.1">
  <asset>
    <contributor>
      <author>Blender User</author>
      <authoring_tool>Blender 2.78.0 commit date:2017-02-24, commit time:14:33, hash:e92f235283</authoring_tool>
    </contributor>
    <created>2017-04-17T18:30:30</created>
    <modified>2017-04-17T18:30:30</modified>
    <unit name="meter" meter="1"/>
    <up_axis>Z_UP</up_axis>
  </asset>
  <library_images/>
  <library_effects>
    <effect id="House6Material-effect">
      <profile_COMMON>
        <technique sid="common">
          <phong>
            <emission>
              <color sid="emission">0 0 0 1</color>
            </emission>
            <ambient>
              <color sid="ambient">0 0 0 1</color>
            </ambient>
            <diffuse>
              <color sid="diffuse">0.64 0.64 0.64 1</color>
            </diffuse>
            <specular>
              <color sid="specular">0.5 0.5 0.5 1</color>
            </specular>
            <shininess>
              <float sid="shininess">50</float>
            </shininess>
            <index_of_refraction>
              <float sid="index_of_refraction">1</float>
            </index_of_refraction>
          </phong>
        </technique>
      </profile_COMMON>
    </effect>
  </library_effects>
  <library_materials>
    <material id="House6Material-material" name="House6Material">
      <instance_effect url="#House6Material-effect"/>
    </material>
  </library_materials>
  <library_geometries>
    <geometry id="Cube-mesh" name="Cube">
      <mesh>
        <source id="Cube-mesh-positions">
          <float_array id="Cube-mesh-positions-array" count="180">1.093167 1.028737 -1.06253 1.093167 -1.017713 -1.06253 -1 -1.017712 -1.06253 -0.9999997 1.028737 -1.06253 1 0.9513595 0.1084107 0.9999997 -0.944947 0.1084107 -1 -0.9444026 0.1132253 -1.031532 0.9517627 0.1132253 1 0.9513595 -0.03426903 0.9999997 -0.944947 -0.03426903 -1 -0.9449465 -0.03426903 -1.031532 0.9513791 -0.03255683 1.093167 1.028737 -0.03255683 1.093166 -1.017713 -0.03255683 -1 -1.017712 -0.03255683 -0.9999998 1.028737 -0.03255683 1.090088 1.031534 0.1132253 1.090087 -1.00492 0.1132253 -1 -1.00492 0.1132253 -0.9999999 1.031535 0.1132253 -2.410385 -0.4039531 -1.06253 -2.486603 2.495515 0.1079963 -2.410386 -0.3911606 0.1132253 -2.486603 2.492718 -0.03778582 -2.365587 -0.3597384 -0.03426903 -2.365586 -0.3591945 0.1132253 -2.46596 2.39548 -0.03609406 -2.46596 2.395863 0.1096881 -2.410386 -0.4039531 -0.03255683 -3.802994 1.055642 -0.03931498 -3.802994 1.056186 0.1081793 -3.896989 1.060027 -0.03778582 -3.896989 1.060027 -1.067759 -2.486603 2.492718 -1.067759 -3.896989 1.07282 0.1079963 -1 -0.8503883 1.00187 -2.296795 -0.2765789 1.00187 0.9335491 -0.8472629 1.00187 -1 0.8823516 1.00187 -1.096903 0.9337861 1.00187 0.942271 0.8724746 1.00187 -3.678882 1.055849 0.9970594 -2.46519 2.266049 0.9970843 1.090001 -1.004835 1.117918 -1.000086 1.03162 1.117918 -1.000086 -1.004834 1.117918 -1.000086 0.8824369 1.117918 -2.410472 -0.3910751 1.117918 -1.096989 0.9338714 1.117918 -2.48669 2.495601 1.112689 -3.778779 0.9564096 1.113106 -3.897075 1.072906 1.112689 -2.360136 2.370973 1.113134 -1.000086 -0.850303 1.117918 -2.296881 -0.2764936 1.117918 0.933463 -0.8471776 1.117918 1.090002 1.031619 1.117918 0.9421849 0.8725599 1.117918 -2.465276 2.266135 1.113132 -3.678968 1.055934 1.113107</float_array>
          <technique_common>
            <accessor source="#Cube-mesh-positions-array" count="60" stride="3">
              <param name="X" type="float"/>
              <param name="Y" type="float"/>
              <param name="Z" type="float"/>
            </accessor>
          </technique_common>
        </source>
        <source id="Cube-mesh-normals">
          <float_array id="Cube-mesh-normals-array" count="333">0 0 -1 -0.3990259 -0.9169397 4.36613e-5 2.27807e-7 1 2.21177e-7 0 0.05994331 -0.9982018 -2.38419e-7 -1 8.35502e-7 1 -2.20297e-7 0 -0.01837438 0 0.9998312 0 0.0235235 0.9997233 1.92246e-4 0.9999966 -0.002631604 0 0 -1 0 -1 0 1 0 -2.3148e-7 8.42798e-4 -3.4354e-4 0.9999996 -0.002407252 0 -0.9999971 0.05336725 0 -0.998575 -0.7016646 -0.7125074 -3.45684e-7 -0.7016282 -0.7125384 0.002630233 -0.001748383 7.12694e-4 0.9999982 -0.01657867 -0.02040517 -0.9996544 2.85176e-7 1 -8.49001e-5 -0.3938924 -0.9191504 0.003389656 0.0102362 0.02352225 0.9996709 -0.6976123 -0.7164756 8.47889e-6 -0.399026 -0.9169397 0 -1.8031e-7 0 -1 0.001785874 -0.001758098 -0.9999969 0.01555007 -0.01530802 0.9997619 0.01732379 0.02115714 0.9996261 0.7094801 0.7047231 -0.00185281 -0.7078416 0.7063664 -0.002602934 -0.7126322 0.7015379 0 0.001475393 -0.002067148 -0.9999969 0.01416206 -0.01403957 -0.9998012 0.7016646 0.7125075 0 -6.24339e-7 0 1 0.694054 0.719923 -1.44473e-5 -0.4688345 -0.8832859 3.00802e-4 0 0 1 -0.001779735 0.001764416 0.9999969 -0.999987 0.00507158 -7.45385e-4 0.7016639 0.7125081 -3.3401e-7 -0.7101724 0.7040278 -1.20826e-4 -0.00177896 0.001764118 0.9999969 0 0 1 0.4046396 0.9144762 -3.7241e-4 -0.005085229 -0.9999868 7.30911e-4 -4.56286e-7 -1 8.51537e-5 -0.7016646 -0.7125074 4.26513e-7 1 -4.66114e-7 8.55485e-5 0.7060875 -0.7081239 0.001044809 -0.001616358 0.9999985 -7.35605e-4 0 0 -1 -0.3990259 -0.9169397 4.38752e-5 1.70855e-7 1 5.56121e-7 -0.002369701 9.36715e-4 -0.9999969 -2.63335e-4 -0.9999933 0.003687918 1 -3.30446e-7 4.17751e-7 -0.0183745 0 0.9998312 0 0.02352344 0.9997233 9.62379e-6 1 0 -2.27807e-7 -1 0 1 -2.26226e-7 2.3148e-7 0 -0.02212232 0.9997553 0 -0.0800212 -0.9967932 0.05336713 0 -0.998575 -0.7016646 -0.7125074 -3.05099e-7 -0.7016285 -0.7125381 0.002630412 0.01720893 0.02104526 0.9996305 0.001763939 -6.97268e-4 -0.9999982 2.28143e-7 1 -8.53808e-5 -0.3938924 -0.9191502 0.003391921 0.0115658 0.02698892 0.9995688 -0.6976124 -0.7164754 8.60627e-6 -0.3990257 -0.9169397 -2.08311e-7 0 0 -1 0.001785993 -0.001758098 -0.9999969 -0.01635891 0.01392132 0.9997693 0.01724588 0.02108287 0.9996291 0.70948 0.7047231 -0.001854419 -0.7078026 0.7064079 -0.001857697 -0.7126324 0.7015377 -2.30281e-7 0.001603007 -0.001943528 -0.9999969 0.001824378 -6.94665e-4 -0.9999981 0.7016646 0.7125074 0 0.6940551 0.7199218 -1.46038e-5 -0.4688347 -0.8832859 3.00122e-4 0 0 1 -0.001779675 0.001764416 0.999997 -0.999987 0.00507158 -7.45386e-4 0.7016646 0.7125074 -3.69644e-7 0.7016647 0.7125074 0 -0.7101724 0.7040278 -1.20517e-4 -0.001779615 0.001764357 0.9999969 -0.001778781 0.001764357 0.9999969 -0.001779735 0.00176537 0.999997 -0.001780152 0.001764416 0.999997 -0.00178039 0.001764416 0.999997 0 0 1 -0.001778364 0.001765072 0.9999969 -0.001780509 0.001764416 0.999997 0 0 1 -1.58406e-6 0 1 5.57657e-7 0 1 0.4046398 0.9144761 -3.72337e-4 -0.00508517 -0.9999869 7.29808e-4 -3.42212e-7 -1 8.47527e-5 -0.7016643 -0.7125077 4.63387e-7 -0.7016669 -0.7125051 5.35991e-7 1 -4.66114e-7 8.59044e-5 0.7060865 -0.7081249 0.001045227 -0.001616358 0.9999985 -7.36342e-4</float_array>
          <technique_common>
            <accessor source="#Cube-mesh-normals-array" count="111" stride="3">
              <param name="X" type="float"/>
              <param name="Y" type="float"/>
              <param name="Z" type="float"/>
            </accessor>
          </technique_common>
        </source>
        <source id="Cube-mesh-map-0">
          <float_array id="Cube-mesh-map-0-array" count="696">0.3243386 0.5000809 0.4270674 0.2491734 0.5009385 0.4284151 0.5973615 0.821823 0.6908916 0.6794416 0.6910322 0.8217429 0.3466714 0.5002308 0.2504675 0.6474025 0.2506436 0.5000809 0.9899007 0.4235433 0.9261832 0.2494938 1 0.4284498 0.9683814 0.9811912 0.9815745 0.8109439 0.9816839 0.9811782 0.465089 0.6239723 0.4783914 0.5000809 0.4783915 0.6239585 0.2405033 0.07693636 0.07387113 0 0.2504675 0.07166779 0.07686328 0.01052665 0 0.1792449 0.07387113 0 0.7026897 0.4998257 0.7157936 0.6428191 0.7022019 0.6428333 0.4270674 0.2491734 0.2504675 0.3208392 0.2536576 0.1785717 0.5011931 1 0.5971068 0.8217428 0.5972208 0.9999072 0.1920555 0.6854301 0.09602773 0.8192155 0.09602779 0.6855298 0.2405033 0.07693636 0.1765964 0.2509128 0.168808 0.2509039 0.8262777 0.4900002 0.7504675 0.3208623 0.7556892 0.3187415 0.9899007 0.4235433 0.8242843 0.4998182 0.8262777 0.4900002 0.5011931 0.4999184 0.5969663 0.6794416 0.5009385 0.6795343 0.9676877 0.6734846 0.981684 0.4998246 0.9814391 0.673491 0.1765964 0.2509128 0.2428039 0.4243125 0.168808 0.2509039 0.9261832 0.2494938 0.9921304 0.07616084 1 0.07089996 0.4403421 0.6473209 0.3468473 0.5000809 0.4405181 0.500216 0.9678232 0.8109375 0.9814391 0.673491 0.9815745 0.8109439 0.006280183 0.1817935 0.003189027 0.3215153 0 0.1792449 0.7268117 0.6645951 0.7161695 0.4998293 0.726989 0.4998257 0.501079 0.8218356 0.5969663 0.6794416 0.5971068 0.8217428 0.7504675 0.3208623 0.7579547 0.1813093 0.7556892 0.3187415 0.4270674 0.2491734 0.3275287 0 0.5009385 0.07060158 0.07999968 0.4918859 0.2504674 0.4294859 0.0770601 0.5000883 0.07999968 0.4918859 0.003189027 0.3215153 0.008586466 0.3192276 0.7022019 0.6428333 0.7159922 0.8304943 0.7024004 0.8305085 0.4542694 0.5001276 0.4406777 0.675201 0.4405181 0.5000809 0.09602773 0.686087 0 0.5000883 0.09602773 0.5000886 0.7536143 0.1785938 0.8293155 0.00863105 0.7579547 0.1813093 0.9921304 0.07616084 0.8274311 0 1 0.07089996 0.3464952 0.6475524 0.2506436 0.8399441 0.2504675 0.6474025 0.7542159 0.7964283 0.8999917 0.725968 0.9010102 0.7360673 0.7019658 0.7614546 0.6913823 0.938739 0.6911462 0.7614533 0.7268117 0.6645951 0.7160062 0.6747118 0.7159922 0.6645988 0.8189777 0.4998182 0.8999917 0.725968 0.7504675 0.6652842 0.9676877 0.8998966 0.7542159 0.7964283 0.9010102 0.7360673 0.489211 0.5000892 0.4783915 0.6136482 0.4783915 0.5000809 0.3468473 0.8397274 0.3468323 0.8233364 0.440518 0.8398624 0.1896986 0.5000883 0.09602779 0.6854301 0.09602773 0.5000883 0.5841396 0.4805557 0.7504675 0.4289246 0.5779011 0.4998256 0.58283 0.01892846 0.5009385 0.1789592 0.5747552 0 0.7019658 0.7614546 0.6912763 0.6357254 0.7020958 0.6357267 0.7268258 0.6747081 0.7161695 0.8403905 0.7160062 0.6747118 0.6910322 0.8217429 0.5974754 0.9997253 0.5973615 0.821823 0.6911462 0.4998257 0.6908916 0.6794416 0.5974552 0.5141987 0 0.6861843 0.09367078 0.8191198 0 0.8192172 0.465089 0.658652 0.4542694 0.500081 0.465089 0.5000809 0.7020958 0.6357267 0.6913822 0.4998257 0.7022018 0.4998269 0.3243386 0.5000809 0.2504675 0.3208392 0.4270674 0.2491734 0.5973615 0.821823 0.5972208 0.6795217 0.6908916 0.6794416 0.3466714 0.5002308 0.3464952 0.6475524 0.2504675 0.6474025 0.9899007 0.4235433 0.9181864 0.2495896 0.9261832 0.2494938 0.9683814 0.9811912 0.9678232 0.8109375 0.9815745 0.8109439 0.465089 0.6239723 0.4650889 0.5000947 0.4783914 0.5000809 0.2405033 0.07693636 0.07686328 0.01052665 0.07387113 0 0.07686328 0.01052665 0.006280183 0.1817935 0 0.1792449 0.7026897 0.4998257 0.7159922 0.4998343 0.7157936 0.6428191 0.5011931 1 0.501079 0.8218356 0.5971068 0.8217428 0.1920555 0.6854301 0.1920555 0.8191158 0.09602773 0.8192155 0.2405033 0.07693636 0.2504675 0.07166779 0.1765964 0.2509128 0.8262777 0.4900002 0.8242843 0.4998182 0.7504675 0.3208623 0.9899007 0.4235433 1 0.4284498 0.8242843 0.4998182 0.5011931 0.4999184 0.5972208 0.4998257 0.5969663 0.6794416 0.9676877 0.6734846 0.9679325 0.4998182 0.981684 0.4998246 0.1765964 0.2509128 0.2504674 0.4294859 0.2428039 0.4243125 0.9261832 0.2494938 0.9181864 0.2495896 0.9921304 0.07616084 0.4403421 0.6473209 0.3466714 0.6471858 0.3468473 0.5000809 0.9678232 0.8109375 0.9676877 0.6734846 0.9814391 0.673491 0.006280183 0.1817935 0.008586466 0.3192276 0.003189027 0.3215153 0.7268117 0.6645951 0.7159922 0.6645988 0.7161695 0.4998293 0.501079 0.8218356 0.5009385 0.6795343 0.5969663 0.6794416 0.7504675 0.3208623 0.7536143 0.1785938 0.7579547 0.1813093 0.4270674 0.2491734 0.2536576 0.1785717 0.3275287 0 0.07999968 0.4918859 0.2428039 0.4243125 0.2504674 0.4294859 0.07999968 0.4918859 0.0770601 0.5000883 0.003189027 0.3215153 0.7022019 0.6428333 0.7157936 0.6428191 0.7159922 0.8304943 0.4542694 0.5001276 0.4542694 0.6752369 0.4406777 0.675201 0.09602773 0.686087 0 0.6860868 0 0.5000883 0.7536143 0.1785938 0.8274311 0 0.8293155 0.00863105 0.9921304 0.07616084 0.8293155 0.00863105 0.8274311 0 0.3464952 0.6475524 0.3466713 0.8400939 0.2506436 0.8399441 0.7542159 0.7964283 0.7504675 0.6652842 0.8999917 0.725968 0.7019658 0.7614546 0.7022019 0.9387402 0.6913823 0.938739 0.7268117 0.6645951 0.7268258 0.6747081 0.7160062 0.6747118 0.8189777 0.4998182 0.9676877 0.5592997 0.8999917 0.725968 0.9676877 0.8998966 0.8204206 0.9614451 0.7542159 0.7964283 0.489211 0.5000892 0.489211 0.6136565 0.4783915 0.6136482 0.4403421 0.6473209 0.440518 0.8398624 0.3468323 0.8233364 0.3468323 0.8233364 0.3466714 0.6471858 0.4403421 0.6473209 0.1896986 0.5000883 0.1896986 0.6854301 0.09602779 0.6854301 0.5841396 0.4805557 0.7314244 0.4190491 0.7504675 0.4289246 0.7441835 0.4137209 0.7504675 0.4289246 0.7314244 0.4190491 0.5779011 0.4998256 0.5720272 0.4856139 0.5841396 0.4805557 0.6647942 0.2552009 0.6637786 0.2451012 0.6766507 0.2503295 0.7441835 0.4137209 0.7314244 0.4190491 0.6647942 0.2552009 0.6766507 0.2503295 0.7441835 0.4137209 0.6647942 0.2552009 0.6766507 0.2503295 0.6637786 0.2451012 0.7315227 0.07845228 0.5841396 0.4805557 0.5720272 0.4856139 0.5040843 0.3212304 0.5179826 0.3155202 0.5841396 0.4805557 0.5040843 0.3212304 0.7504674 0.07137024 0.6766507 0.2503295 0.7315227 0.07845228 0.7504674 0.07137024 0.7315227 0.07845228 0.5747552 0 0.5179826 0.3155202 0.5040843 0.3212304 0.514272 0.1843749 0.514272 0.1843749 0.5040843 0.3212304 0.5009385 0.1789592 0.5747552 0 0.7315227 0.07845228 0.58283 0.01892846 0.58283 0.01892846 0.514272 0.1843749 0.5009385 0.1789592 0.7019658 0.7614546 0.6911462 0.7614533 0.6912763 0.6357254 0.7268258 0.6747081 0.726989 0.8403868 0.7161695 0.8403905 0.6910322 0.8217429 0.6911462 0.9996452 0.5974754 0.9997253 0.5972208 0.6795217 0.5974552 0.5141987 0.6908916 0.6794416 0.5974754 0.4999058 0.6911462 0.4998257 0.5974552 0.5141987 0 0.6861843 0.09367072 0.686087 0.09367078 0.8191198 0.465089 0.658652 0.4542694 0.658652 0.4542694 0.500081 0.7020958 0.6357267 0.6912763 0.6357254 0.6913822 0.4998257</float_array>
          <technique_common>
            <accessor source="#Cube-mesh-map-0-array" count="348" stride="2">
              <param name="S" type="float"/>
              <param name="T" type="float"/>
            </accessor>
          </technique_common>
        </source>
        <vertices id="Cube-mesh-vertices">
          <input semantic="POSITION" source="#Cube-mesh-positions"/>
        </vertices>
        <polylist material="House6Material-material" count="116">
          <input semantic="VERTEX" source="#Cube-mesh-vertices" offset="0"/>
          <input semantic="NORMAL" source="#Cube-mesh-normals" offset="1"/>
          <input semantic="TEXCOORD" source="#Cube-mesh-map-0" offset="2" set="0"/>
          <vcount>3 3 3 3 3 3 3 3 3 3 3 3 3 3 3 3 3 3 3 3 3 3 3 3 3 3 3 3 3 3 3 3 3 3 3 3 3 3 3 3 3 3 3 3 3 3 3 3 3 3 3 3 3 3 3 3 3 3 3 3 3 3 3 3 3 3 3 3 3 3 3 3 3 3 3 3 3 3 3 3 3 3 3 3 3 3 3 3 3 3 3 3 3 3 3 3 3 3 3 3 3 3 3 3 3 3 3 3 3 3 3 3 3 3 3 3 </vcount>
          <p>1 0 0 3 0 1 0 0 2 45 1 3 22 1 4 18 1 5 0 2 6 15 2 7 12 2 8 4 3 9 19 3 10 16 3 11 5 4 12 10 4 13 9 4 14 4 5 15 9 5 16 8 5 17 8 6 18 13 6 19 12 6 20 9 7 21 14 7 22 13 7 23 4 8 24 11 8 25 7 8 26 3 9 27 2 9 28 20 9 29 13 10 30 2 10 31 1 10 32 12 11 33 1 11 34 0 11 35 8 12 36 15 12 37 11 12 38 5 13 39 18 13 40 6 13 41 4 14 42 17 14 43 5 14 44 31 15 45 20 15 46 28 15 47 25 16 48 29 16 49 24 16 50 15 17 51 26 17 52 11 17 53 19 18 54 27 18 55 21 18 56 19 19 57 56 19 58 16 19 59 6 20 60 24 20 61 10 20 62 10 21 63 28 21 64 14 21 65 39 22 66 58 22 67 42 22 68 14 23 69 20 23 70 2 23 71 18 24 72 25 24 73 6 24 74 3 25 75 32 25 76 33 25 77 29 26 78 23 26 79 31 26 80 29 27 81 28 27 82 24 27 83 7 28 84 26 28 85 27 28 86 30 29 87 26 29 88 29 29 89 32 30 90 23 30 91 33 30 92 22 31 93 30 31 94 25 31 95 27 32 96 34 32 97 21 32 98 3 33 99 23 33 100 15 33 101 36 34 102 38 34 103 39 34 104 36 35 105 59 35 106 54 35 107 39 36 108 46 36 109 48 36 110 37 37 111 38 37 112 35 37 113 42 38 114 36 38 115 39 38 116 40 39 117 55 39 118 57 39 119 49 40 120 52 40 121 21 40 122 21 41 123 51 41 124 49 41 125 59 42 126 49 42 127 51 42 128 55 43 129 45 43 130 43 43 131 36 44 132 53 44 133 35 44 134 38 45 135 57 45 136 46 45 137 18 46 138 43 46 139 45 46 140 34 47 141 22 47 142 50 47 143 43 48 144 16 48 145 56 48 146 42 49 147 59 49 148 41 49 149 35 50 150 55 50 151 37 50 152 1 51 153 2 51 154 3 51 155 45 52 156 47 52 157 22 52 158 0 53 159 3 53 160 15 53 161 4 54 162 7 54 163 19 54 164 5 55 165 6 55 166 10 55 167 4 56 168 5 56 169 9 56 170 8 57 171 9 57 172 13 57 173 9 58 174 10 58 175 14 58 176 4 59 177 8 59 178 11 59 179 13 60 180 14 60 181 2 60 182 12 61 183 13 61 184 1 61 185 8 62 186 12 62 187 15 62 188 5 63 189 17 63 190 18 63 191 4 64 192 16 64 193 17 64 194 31 65 195 32 65 196 20 65 197 25 66 198 30 66 199 29 66 200 15 67 201 23 67 202 26 67 203 19 68 204 7 68 205 27 68 206 19 69 207 44 69 208 56 69 209 6 70 210 25 70 211 24 70 212 10 71 213 24 71 214 28 71 215 39 72 216 48 72 217 58 72 218 14 73 219 28 73 220 20 73 221 18 74 222 22 74 223 25 74 224 3 75 225 20 75 226 32 75 227 29 76 228 26 76 229 23 76 230 29 77 231 31 77 232 28 77 233 7 78 234 11 78 235 26 78 236 30 79 237 27 79 238 26 79 239 32 80 240 31 80 241 23 80 242 22 81 243 34 81 244 30 81 245 27 82 246 30 82 247 34 82 248 3 83 249 33 83 250 23 83 251 36 37 252 35 37 253 38 37 254 36 84 255 41 84 256 59 84 257 39 85 258 38 85 259 46 85 260 37 86 261 40 86 262 38 86 263 42 87 264 41 87 265 36 87 266 40 88 267 37 88 268 55 88 269 19 89 270 21 89 271 52 89 272 52 90 273 44 90 274 19 90 275 21 91 276 34 91 277 51 91 278 59 92 279 58 92 280 49 92 281 52 93 282 49 93 283 58 93 284 51 94 285 50 94 286 59 94 287 48 37 288 46 37 289 44 37 290 52 95 291 58 95 292 48 95 293 44 96 294 52 96 295 48 96 296 44 97 297 46 97 298 57 97 299 59 98 300 50 98 301 47 98 302 54 99 303 59 99 304 47 99 305 56 100 306 44 100 307 57 100 308 56 101 309 57 101 310 43 101 311 54 102 312 47 102 313 53 102 314 53 37 315 47 37 316 45 37 317 43 37 318 57 37 319 55 37 320 55 37 321 53 37 322 45 37 323 36 103 324 54 103 325 53 103 326 38 104 327 40 104 328 57 104 329 18 105 330 17 105 331 43 105 332 47 106 333 50 106 334 22 106 335 51 107 336 34 107 337 50 107 338 43 108 339 17 108 340 16 108 341 42 109 342 58 109 343 59 109 344 35 110 345 53 110 346 55 110 347</p>
        </polylist>
      </mesh>
    </geometry>
  </library_geometries>
  <library_controllers/>
  <library_visual_scenes>
    <visual_scene id="Scene" name="Scene">
      <node id="House6" name="House6" type="NODE">
        <matrix sid="transform">1 0 0 1.387101 0 1 0 -0.3826714 0 0 1 1.088128 0 0 0 1</matrix>
        <instance_geometry url="#Cube-mesh" name="House6">
          <bind_material>
            <technique_common>
              <instance_material symbol="House6Material-material" target="#House6Material-material"/>
            </technique_common>
          </bind_material>
        </instance_geometry>
      </node>
    </visual_scene>
  </library_visual_scenes>
  <scene>
    <instance_visual_scene url="#Scene"/>
  </scene>
</COLLADA>