%YAML 1.1
%TAG !u! tag:unity3d.com,2011:
--- !u!114 &11400000
MonoBehaviour:
  m_ObjectHideFlags: 0
  m_CorrespondingSourceObject: {fileID: 0}
  m_PrefabInstance: {fileID: 0}
  m_PrefabAsset: {fileID: 0}
  m_GameObject: {fileID: 0}
  m_Enabled: 1
  m_EditorHideFlags: 0
  m_Script: {fileID: 11500000, guid: c92b41a396d86a948beecceed6c5134f, type: 3}
  m_Name: TomatoSlices
  m_EditorClassIdentifier: 
  prefab: {fileID: 7147278072433650094, guid: 1926d8b2401fc9c4e82386d97d28ce3f, type: 3}
  sprite: {fileID: 21300000, guid: c9f08c3c1ae2a364aaeaa3712540b1d4, type: 3}
  objectName: Tomato Slices
