%YAML 1.1
%TAG !u! tag:unity3d.com,2011:
--- !u!1 &3243541713594871329
GameObject:
  m_ObjectHideFlags: 0
  m_CorrespondingSourceObject: {fileID: 0}
  m_PrefabInstance: {fileID: 0}
  m_PrefabAsset: {fileID: 0}
  serializedVersion: 6
  m_Component:
  - component: {fileID: 7147278072433650094}
  - component: {fileID: -6177511396632301485}
  m_Layer: 0
  m_Name: TomatoSlices
  m_TagString: Untagged
  m_Icon: {fileID: 0}
  m_NavMeshLayer: 0
  m_StaticEditorFlags: 0
  m_IsActive: 1
--- !u!4 &7147278072433650094
Transform:
  m_ObjectHideFlags: 0
  m_CorrespondingSourceObject: {fileID: 0}
  m_PrefabInstance: {fileID: 0}
  m_PrefabAsset: {fileID: 0}
  m_GameObject: {fileID: 3243541713594871329}
  serializedVersion: 2
  m_LocalRotation: {x: 0, y: 0, z: 0, w: 1}
  m_LocalPosition: {x: 0, y: 0, z: 0}
  m_LocalScale: {x: 1, y: 1, z: 1}
  m_ConstrainProportionsScale: 0
  m_Children:
  - {fileID: 5405001181315310374}
  m_Father: {fileID: 0}
  m_LocalEulerAnglesHint: {x: 0, y: 0, z: 0}
--- !u!114 &-6177511396632301485
MonoBehaviour:
  m_ObjectHideFlags: 0
  m_CorrespondingSourceObject: {fileID: 0}
  m_PrefabInstance: {fileID: 0}
  m_PrefabAsset: {fileID: 0}
  m_GameObject: {fileID: 3243541713594871329}
  m_Enabled: 1
  m_EditorHideFlags: 0
  m_Script: {fileID: 11500000, guid: d61838d8f1a21a342bc89f3c3af51714, type: 3}
  m_Name: 
  m_EditorClassIdentifier: 
  kitchenObjectSO: {fileID: 11400000, guid: 1dd10672144133d49a6f06a5dea06786, type: 2}
--- !u!1001 &9216727572076115366
PrefabInstance:
  m_ObjectHideFlags: 0
  serializedVersion: 2
  m_Modification:
    serializedVersion: 3
    m_TransformParent: {fileID: 7147278072433650094}
    m_Modifications:
    - target: {fileID: 3812876574508226176, guid: fb403d1efda6baf4190c507841617408,
        type: 3}
      propertyPath: m_LocalPosition.x
      value: 0
      objectReference: {fileID: 0}
    - target: {fileID: 3812876574508226176, guid: fb403d1efda6baf4190c507841617408,
        type: 3}
      propertyPath: m_LocalPosition.y
      value: 0
      objectReference: {fileID: 0}
    - target: {fileID: 3812876574508226176, guid: fb403d1efda6baf4190c507841617408,
        type: 3}
      propertyPath: m_LocalPosition.z
      value: 0
      objectReference: {fileID: 0}
    - target: {fileID: 3812876574508226176, guid: fb403d1efda6baf4190c507841617408,
        type: 3}
      propertyPath: m_LocalRotation.w
      value: 1
      objectReference: {fileID: 0}
    - target: {fileID: 3812876574508226176, guid: fb403d1efda6baf4190c507841617408,
        type: 3}
      propertyPath: m_LocalRotation.x
      value: 0
      objectReference: {fileID: 0}
    - target: {fileID: 3812876574508226176, guid: fb403d1efda6baf4190c507841617408,
        type: 3}
      propertyPath: m_LocalRotation.y
      value: 0
      objectReference: {fileID: 0}
    - target: {fileID: 3812876574508226176, guid: fb403d1efda6baf4190c507841617408,
        type: 3}
      propertyPath: m_LocalRotation.z
      value: 0
      objectReference: {fileID: 0}
    - target: {fileID: 3812876574508226176, guid: fb403d1efda6baf4190c507841617408,
        type: 3}
      propertyPath: m_LocalEulerAnglesHint.x
      value: 0
      objectReference: {fileID: 0}
    - target: {fileID: 3812876574508226176, guid: fb403d1efda6baf4190c507841617408,
        type: 3}
      propertyPath: m_LocalEulerAnglesHint.y
      value: 0
      objectReference: {fileID: 0}
    - target: {fileID: 3812876574508226176, guid: fb403d1efda6baf4190c507841617408,
        type: 3}
      propertyPath: m_LocalEulerAnglesHint.z
      value: 0
      objectReference: {fileID: 0}
    - target: {fileID: 3812876574508226177, guid: fb403d1efda6baf4190c507841617408,
        type: 3}
      propertyPath: m_Name
      value: TomatoSlices_Visual
      objectReference: {fileID: 0}
    m_RemovedComponents: []
    m_RemovedGameObjects: []
    m_AddedGameObjects: []
    m_AddedComponents: []
  m_SourcePrefab: {fileID: 100100000, guid: fb403d1efda6baf4190c507841617408, type: 3}
--- !u!4 &5405001181315310374 stripped
Transform:
  m_CorrespondingSourceObject: {fileID: 3812876574508226176, guid: fb403d1efda6baf4190c507841617408,
    type: 3}
  m_PrefabInstance: {fileID: 9216727572076115366}
  m_PrefabAsset: {fileID: 0}
