%YAML 1.1
%TAG !u! tag:unity3d.com,2011:
--- !u!114 &11400000
MonoBehaviour:
  m_ObjectHideFlags: 0
  m_CorrespondingSourceObject: {fileID: 0}
  m_PrefabInstance: {fileID: 0}
  m_PrefabAsset: {fileID: 0}
  m_GameObject: {fileID: 0}
  m_Enabled: 1
  m_EditorHideFlags: 0
  m_Script: {fileID: 11500000, guid: c92b41a396d86a948beecceed6c5134f, type: 3}
  m_Name: CheeseBlock
  m_EditorClassIdentifier: 
  prefab: {fileID: 7147278072433650094, guid: 2e349b14ac189a945a58da18a4844979, type: 3}
  sprite: {fileID: 21300000, guid: da2d04fe27b94e34ea0b624569b48a6f, type: 3}
  objectName: Cheese Block
