{
  "project_info": {
    "project_number": "1004460300104",
    "firebase_url": "https://laundry-1537281702894.firebaseio.com",
    "project_id": "laundry-1537281702894",
    "storage_bucket": "laundry-1537281702894.appspot.com"
  },
  "client": [
    {
      "client_info": {
        "mobilesdk_app_id": "1:1004460300104:android:2b6065e31659e7f6",
        "android_client_info": {
          "package_name": "com.phonegap.helloworld"
        }
      },
      "oauth_client": [
        {
          "client_id": "1004460300104-bjs4o2i92990rpiufsocmik1ou87cvre.apps.googleusercontent.com",
          "client_type": 3
        }
      ],
      "api_key": [
        {
          "current_key": "AIzaSyCI1YB2ePwIYfvAXJp0cNc93vR5usE_ek8"
        }
      ],
      "services": {
        "analytics_service": {
          "status": 1
        },
        "appinvite_service": {
          "status": 1,
          "other_platform_oauth_client": []
        },
        "ads_service": {
          "status": 2
        }
      }
    },
    {
      "client_info": {
        "mobilesdk_app_id": "1:1004460300104:android:58c2ab7796f88c57",
        "android_client_info": {
          "package_name": "com.zapt.laundryApp"
        }
      },
      "oauth_client": [
        {
          "client_id": "1004460300104-bjs4o2i92990rpiufsocmik1ou87cvre.apps.googleusercontent.com",
          "client_type": 3
        }
      ],
      "api_key": [
        {
          "current_key": "AIzaSyCI1YB2ePwIYfvAXJp0cNc93vR5usE_ek8"
        }
      ],
      "services": {
        "analytics_service": {
          "status": 1
        },
        "appinvite_service": {
          "status": 1,
          "other_platform_oauth_client": []
        },
        "ads_service": {
          "status": 2
        }
      }
    }
  ],
  "configuration_version": "1"
}