{
    "parent": "minecraft:block/carved_pumpkin",
    "overrides": [
        {
            "predicate": {
                "custom_model_data": 1
            },
            "model": "denim:enderoid/enderoid"
        },
        {
            "predicate": {
                "custom_model_data": 2
            },
            "model": "denim:enderoid/enderoid_jaw"
        },
        {
            "predicate": {
                "custom_model_data": 3
            },
            "model": "denim:enderoid/enderoid_jaw2"
        },
        {
            "predicate": {
                "custom_model_data": 4
            },
            "model": "denim:enderoid/enderoid_look_up_22deg"
        },
        {
            "predicate": {
                "custom_model_data": 5
            },
            "model": "denim:enderoid/enderoid_look_up_22deg_jaw"
        },
        {
            "predicate": {
                "custom_model_data": 6
            },
            "model": "denim:enderoid/enderoid_look_up_22deg_jaw2"
        },
        {
            "predicate": {
                "custom_model_data": 7
            },
            "model": "denim:enderoid/enderoid_look_up_22deg_walk_left"
        },
        {
            "predicate": {
                "custom_model_data": 8
            },
            "model": "denim:enderoid/enderoid_look_up_22deg_jaw_walk_left"
        },
        {
            "predicate": {
                "custom_model_data": 9
            },
            "model": "denim:enderoid/enderoid_look_up_22deg_jaw2_walk_left"
        },
        {
            "predicate": {
                "custom_model_data": 10
            },
            "model": "denim:enderoid/enderoid_look_up_22deg_walk_right"
        },
        {
            "predicate": {
                "custom_model_data": 11
            },
            "model": "denim:enderoid/enderoid_look_up_22deg_jaw_walk_right"
        },
        {
            "predicate": {
                "custom_model_data": 12
            },
            "model": "denim:enderoid/enderoid_look_up_22deg_jaw2_walk_right"
        },
        {
            "predicate": {
                "custom_model_data": 13
            },
            "model": "denim:enderoid/enderoid_look_up_45deg"
        },
        {
            "predicate": {
                "custom_model_data": 14
            },
            "model": "denim:enderoid/enderoid_look_up_45deg_jaw"
        },
        {
            "predicate": {
                "custom_model_data": 15
            },
            "model": "denim:enderoid/enderoid_look_up_45deg_jaw2"
        },
        {
            "predicate": {
                "custom_model_data": 16
            },
            "model": "denim:enderoid/enderoid_look_up_45deg_walk_left"
        },
        {
            "predicate": {
                "custom_model_data": 17
            },
            "model": "denim:enderoid/enderoid_look_up_45deg_jaw_walk_left"
        },
        {
            "predicate": {
                "custom_model_data": 18
            },
            "model": "denim:enderoid/enderoid_look_up_45deg_jaw2_walk_left"
        },
        {
            "predicate": {
                "custom_model_data": 19
            },
            "model": "denim:enderoid/enderoid_look_up_45deg_walk_right"
        },
        {
            "predicate": {
                "custom_model_data": 20
            },
            "model": "denim:enderoid/enderoid_look_up_45deg_jaw_walk_right"
        },
        {
            "predicate": {
                "custom_model_data": 21
            },
            "model": "denim:enderoid/enderoid_look_up_45deg_jaw2_walk_right"
        },
        {
            "predicate": {
                "custom_model_data": 22
            },
            "model": "denim:enderoid/enderoid_walk_left"
        },
        {
            "predicate": {
                "custom_model_data": 23
            },
            "model": "denim:enderoid/enderoid_walk_right"
        },
        {
            "predicate": {
                "custom_model_data": 24
            },
            "model": "denim:enderoid/enderoid_mount"
        },
        {
            "predicate": {
                "custom_model_data": 25
            },
            "model": "denim:enderoid/enderoid_mount_jaw"
        },
        {
            "predicate": {
                "custom_model_data": 26
            },
            "model": "denim:enderoid/enderoid_mount_jaw2"
        }
    ]
}