{
    "credit": "Made with Blockbench",
    "textures": {
        "0": "denim:enderoid/enderoid",
        "particle": "denim:enderoid/enderoid"
    },
    "elements": [
        {
            "name": "torso",
            "from": [
                3,
                7,
                7
            ],
            "to": [
                13,
                19,
                11
            ],
            "rotation": {
                "angle": -22.5,
                "axis": "x",
                "origin": [
                    8,
                    13,
                    9
                ]
            },
            "faces": {
                "north": {
                    "uv": [
                        1,
                        8.25,
                        3.5,
                        11.25
                    ],
                    "texture": "#0"
                },
                "east": {
                    "uv": [
                        0,
                        8.25,
                        1,
                        11.25
                    ],
                    "texture": "#0"
                },
                "south": {
                    "uv": [
                        4.5,
                        8.25,
                        7,
                        11.25
                    ],
                    "texture": "#0"
                },
                "west": {
                    "uv": [
                        3.5,
                        8.25,
                        4.5,
                        11.25
                    ],
                    "texture": "#0"
                },
                "up": {
                    "uv": [
                        1,
                        7.25,
                        3.5,
                        8.25
                    ],
                    "texture": "#0"
                },
                "down": {
                    "uv": [
                        3.5,
                        8.25,
                        6,
                        7.25
                    ],
                    "texture": "#0"
                }
            }
        },
        {
            "name": "leg_right",
            "from": [
                9,
                0,
                9
            ],
            "to": [
                13,
                7,
                13
            ],
            "rotation": {
                "angle": -22.5,
                "axis": "x",
                "origin": [
                    11,
                    6.5,
                    11
                ]
            },
            "faces": {
                "north": {
                    "uv": [
                        8,
                        12.25,
                        9,
                        14
                    ],
                    "texture": "#0"
                },
                "east": {
                    "uv": [
                        7,
                        12.25,
                        8,
                        14
                    ],
                    "texture": "#0"
                },
                "south": {
                    "uv": [
                        10,
                        12.25,
                        11,
                        14
                    ],
                    "texture": "#0"
                },
                "west": {
                    "uv": [
                        9,
                        12.25,
                        10,
                        14
                    ],
                    "texture": "#0"
                },
                "up": {
                    "uv": [
                        8,
                        11.25,
                        9,
                        12.25
                    ],
                    "texture": "#0"
                },
                "down": {
                    "uv": [
                        9,
                        11.25,
                        10,
                        12.25
                    ],
                    "texture": "#0"
                }
            }
        },
        {
            "name": "leg_left",
            "from": [
                3,
                0,
                9
            ],
            "to": [
                7,
                7,
                13
            ],
            "rotation": {
                "angle": 22.5,
                "axis": "x",
                "origin": [
                    5,
                    6.5,
                    11
                ]
            },
            "faces": {
                "north": {
                    "uv": [
                        13,
                        12.25,
                        14,
                        14
                    ],
                    "texture": "#0"
                },
                "east": {
                    "uv": [
                        12,
                        12.25,
                        13,
                        14
                    ],
                    "texture": "#0"
                },
                "south": {
                    "uv": [
                        15,
                        12.25,
                        16,
                        14
                    ],
                    "texture": "#0"
                },
                "west": {
                    "uv": [
                        14,
                        12.25,
                        15,
                        14
                    ],
                    "texture": "#0"
                },
                "up": {
                    "uv": [
                        13,
                        11.25,
                        14,
                        12.25
                    ],
                    "texture": "#0"
                },
                "down": {
                    "uv": [
                        14,
                        11.25,
                        15,
                        12.25
                    ],
                    "texture": "#0"
                }
            }
        },
        {
            "name": "arm_left",
            "from": [
                -1,
                10.84568,
                6.22417
            ],
            "to": [
                3,
                17.84568,
                10.22417
            ],
            "rotation": {
                "angle": 45,
                "axis": "x",
                "origin": [
                    1,
                    17.5,
                    8
                ]
            },
            "faces": {
                "north": {
                    "uv": [
                        13,
                        8.25,
                        14,
                        10
                    ],
                    "texture": "#0"
                },
                "east": {
                    "uv": [
                        12,
                        8.25,
                        13,
                        10
                    ],
                    "texture": "#0"
                },
                "south": {
                    "uv": [
                        15,
                        8.25,
                        16,
                        10
                    ],
                    "texture": "#0"
                },
                "west": {
                    "uv": [
                        14,
                        8.25,
                        15,
                        10
                    ],
                    "texture": "#0"
                },
                "up": {
                    "uv": [
                        14,
                        8.25,
                        13,
                        7.25
                    ],
                    "texture": "#0"
                },
                "down": {
                    "uv": [
                        14,
                        7.25,
                        15,
                        8.25
                    ],
                    "texture": "#0"
                }
            }
        },
        {
            "name": "arm_right",
            "from": [
                13,
                10.84568,
                6.22417
            ],
            "to": [
                17,
                17.84568,
                10.22417
            ],
            "rotation": {
                "angle": 0,
                "axis": "x",
                "origin": [
                    15,
                    17.5,
                    8
                ]
            },
            "faces": {
                "north": {
                    "uv": [
                        8,
                        8.25,
                        9,
                        10
                    ],
                    "texture": "#0"
                },
                "east": {
                    "uv": [
                        7,
                        8.25,
                        8,
                        10
                    ],
                    "texture": "#0"
                },
                "south": {
                    "uv": [
                        10,
                        8.25,
                        11,
                        10
                    ],
                    "texture": "#0"
                },
                "west": {
                    "uv": [
                        9,
                        8.25,
                        10,
                        10
                    ],
                    "texture": "#0"
                },
                "up": {
                    "uv": [
                        9,
                        8.25,
                        8,
                        7.25
                    ],
                    "texture": "#0"
                },
                "down": {
                    "uv": [
                        9,
                        7.25,
                        10,
                        8.25
                    ],
                    "texture": "#0"
                }
            }
        },
        {
            "name": "jaw",
            "from": [
                4,
                18,
                0.725
            ],
            "to": [
                11.95,
                25.95,
                8.675
            ],
            "rotation": {
                "angle": 45,
                "axis": "x",
                "origin": [
                    8,
                    20,
                    8
                ]
            },
            "faces": {
                "north": {
                    "uv": [
                        10,
                        2,
                        12,
                        4
                    ],
                    "texture": "#0"
                },
                "east": {
                    "uv": [
                        8,
                        2,
                        10,
                        4
                    ],
                    "texture": "#0"
                },
                "south": {
                    "uv": [
                        14,
                        2,
                        16,
                        4
                    ],
                    "texture": "#0"
                },
                "west": {
                    "uv": [
                        12,
                        2,
                        14,
                        4
                    ],
                    "texture": "#0"
                },
                "up": {
                    "uv": [
                        10,
                        0,
                        12,
                        2
                    ],
                    "texture": "#0"
                },
                "down": {
                    "uv": [
                        12,
                        0,
                        14,
                        2
                    ],
                    "texture": "#0"
                }
            }
        },
        {
            "name": "head",
            "from": [
                3,
                19,
                0
            ],
            "to": [
                13,
                27,
                8
            ],
            "rotation": {
                "angle": 45,
                "axis": "x",
                "origin": [
                    8,
                    19,
                    8
                ]
            },
            "faces": {
                "north": {
                    "uv": [
                        2,
                        4,
                        4.5,
                        6
                    ],
                    "texture": "#0"
                },
                "east": {
                    "uv": [
                        0,
                        4,
                        2,
                        6
                    ],
                    "texture": "#0"
                },
                "south": {
                    "uv": [
                        6.5,
                        4,
                        9,
                        6
                    ],
                    "texture": "#0"
                },
                "west": {
                    "uv": [
                        4.5,
                        4,
                        6.5,
                        6
                    ],
                    "texture": "#0"
                },
                "up": {
                    "uv": [
                        4.5,
                        4,
                        2,
                        2
                    ],
                    "texture": "#0"
                },
                "down": {
                    "uv": [
                        4.5,
                        4,
                        7,
                        2
                    ],
                    "texture": "#0"
                }
            }
        },
        {
            "name": "horn_right",
            "from": [
                11,
                29.7,
                8.5
            ],
            "to": [
                12,
                31.7,
                9.5
            ],
            "rotation": {
                "angle": 22.5,
                "axis": "x",
                "origin": [
                    8,
                    30.7,
                    9
                ]
            },
            "faces": {
                "north": {
                    "uv": [
                        2.25,
                        13.5,
                        2.5,
                        14
                    ],
                    "texture": "#0"
                },
                "east": {
                    "uv": [
                        2,
                        13.5,
                        2.25,
                        14
                    ],
                    "texture": "#0"
                },
                "south": {
                    "uv": [
                        2.75,
                        13.5,
                        3,
                        14
                    ],
                    "texture": "#0"
                },
                "west": {
                    "uv": [
                        2.5,
                        13.5,
                        2.75,
                        14
                    ],
                    "texture": "#0"
                },
                "up": {
                    "uv": [
                        2.5,
                        13.5,
                        2.25,
                        13.25
                    ],
                    "texture": "#0"
                },
                "down": {
                    "uv": [
                        2.75,
                        13.5,
                        2.5,
                        13.25
                    ],
                    "texture": "#0"
                }
            }
        },
        {
            "name": "horn_left",
            "from": [
                4,
                29.7,
                8.5
            ],
            "to": [
                5,
                31.7,
                9.5
            ],
            "rotation": {
                "angle": 22.5,
                "axis": "x",
                "origin": [
                    8,
                    30.7,
                    9
                ]
            },
            "faces": {
                "north": {
                    "uv": [
                        1,
                        13.5,
                        1.25,
                        14
                    ],
                    "texture": "#0"
                },
                "east": {
                    "uv": [
                        0.75,
                        13.5,
                        1,
                        14
                    ],
                    "texture": "#0"
                },
                "south": {
                    "uv": [
                        1.5,
                        13.5,
                        1.75,
                        14
                    ],
                    "texture": "#0"
                },
                "west": {
                    "uv": [
                        1.25,
                        13.5,
                        1.5,
                        14
                    ],
                    "texture": "#0"
                },
                "up": {
                    "uv": [
                        1.25,
                        13.5,
                        1,
                        13.25
                    ],
                    "texture": "#0"
                },
                "down": {
                    "uv": [
                        1.5,
                        13.5,
                        1.25,
                        13.25
                    ],
                    "texture": "#0"
                }
            }
        }
    ],
    "display": {
        "head": {
            "translation": [
                0,
                -16.5,
                6.5
            ],
            "scale": [
                1.75,
                1.75,
                1.75
            ]
        }
    },
    "groups": [
        0,
        1,
        2,
        3,
        4,
        {
            "name": "head",
            "origin": [
                8,
                27.7,
                0
            ],
            "color": 0,
            "children": [
                5,
                {
                    "name": "head_top",
                    "origin": [
                        8,
                        27.7,
                        0
                    ],
                    "color": 0,
                    "children": [
                        6,
                        7,
                        8
                    ]
                }
            ]
        }
    ]
}