<svg xmlns="http://www.w3.org/2000/svg" width="16" height="16" viewBox="0 0 16 16" fill="none">
  <path fill-rule="evenodd" clip-rule="evenodd" d="M3.33332 0H12.6667C13.0348 0 13.3333 0.298477 13.3333 0.666667V14.8932C13.3333 15.2614 13.0348 15.5598 12.6667 15.5598C12.5349 15.5598 12.4061 15.5208 12.2966 15.4477L8.37008 12.827C8.14602 12.6775 7.85396 12.6775 7.6299 12.827L3.70342 15.4477C3.39717 15.6521 2.98321 15.5695 2.77882 15.2633C2.70569 15.1537 2.66666 15.0249 2.66666 14.8932V0.666667C2.66666 0.298477 2.96513 0 3.33332 0Z" fill="#29333D"/>
</svg>
