<svg width="24" height="24" viewBox="0 0 24 24" fill="none" xmlns="http://www.w3.org/2000/svg">
  <path fill-rule="evenodd" clip-rule="evenodd"
    d="M10 7H21C22.6569 7 24 8.34315 24 10V21C24 22.6569 22.6569 24 21 24H10C8.34315 24 7 22.6569 7 21V10C7 8.34315 8.34315 7 10 7ZM17 5H10C7.23858 5 5 7.23858 5 10V17H3C1.34315 17 0 15.6569 0 14V3C0 1.34315 1.34315 0 3 0H14C15.6569 0 17 1.34315 17 3V5Z"
    fill="#52667A" />
</svg>
