{
  "openapi": "3.0.0",
  "info": [],
  "paths": [],
  "components": {
    "schemas": {
      "UpdateAttendeeRequestBody": {
        "type": "object",
        "required": [
          "attendeeName",
          "videoUserId",
          "guideCartPermissionsGranted",
          "attendeeSubmitted"
        ],
        "properties": {
          "attendeeName": {
            "type":"string",
            "description":"Name of the attendee"
          },
          "videoUserId": {
            "type":"string",
            "description":"Id of the attendee in the video chat tool"
          },
          "guideCartPermissionsGranted": {
            "type":"boolean",
            "description":"The permission for guide cart actions"
          },
          "attendeeSubmitted": {
            "type":"boolean",
            "description":"The first time the attendee submit the update form"
          }
        }
      }
    }
  }
}
