<svg width="24" height="23" viewBox="0 0 24 23" fill="none" xmlns="http://www.w3.org/2000/svg">
  <path fill-rule="evenodd" clip-rule="evenodd"
    d="M12 17.8397L18.0066 20.4866L17.3454 13.956L21.7189 9.06132L15.3036 7.67211L12 2.00008L8.6963 7.67211L2.28099 9.06132L6.65453 13.956L5.99331 20.4866L12 17.8397ZM6.7998 22.3168C5.78902 22.7622 4.60854 22.3039 4.16313 21.2931C4.02364 20.9766 3.96864 20.6293 4.00348 20.2852L4.57592 14.6314L0.789612 10.3939C0.0536467 9.57023 0.124744 8.3059 0.948413 7.56994C1.20635 7.33946 1.51965 7.17983 1.85771 7.10662L7.41165 5.90394L10.2717 0.993483C10.8277 0.0390117 12.0521 -0.284071 13.0066 0.271859C13.3054 0.44595 13.5541 0.694586 13.7282 0.993483L16.5883 5.90394L22.1422 7.10662C23.2217 7.3404 23.9074 8.40505 23.6736 9.4846C23.6004 9.82267 23.4408 10.136 23.2103 10.3939L19.424 14.6314L19.9964 20.2852C20.1077 21.3841 19.307 22.3652 18.2081 22.4765C17.8639 22.5113 17.5166 22.4563 17.2001 22.3168L12 20.0253L6.7998 22.3168Z"
    fill="#758CA3" />
</svg>
