{
    "openapi": "3.0.0",
    "info": [],
    "paths": [],
    "components": {
        "schemas": {
            "DynamicProductListingPageOpenedPayload": {
                "allOf": [
                    {
                        "$ref": "#/components/schemas/AbstractDynamicPageOpenedPayload"
                    }
                ],
                "required": [
                    "page"
                ],
                "properties": {
                    "page": {
                        "type": "integer",
                        "description": "Current page position in the pagination"
                    }
                }
            }
        }
    }
}
