{
  "openapi": "3.0.0",
  "info": [],
  "paths": {
    "/guided-shopping/appointment/presentation": {
      "get": {
        "tags": [
          "Presentation"
        ],
        "summary": "Fetch presentation structure and flat navigation",
        "description": "Resolves the presentation structure and navigation by using the attendeeContext information. There will be NO Slot-Data inside call store-api.guided-shopping.presentation-data for that",
        "operationId": "getPresentationStructure",
        "parameters": [],
        "responses": {
          "200": {
            "description": "",
            "content": {
              "application/json": {
                "schema": {
                  "$ref": "#/components/schemas/PresentationStructure"
                }
              }
            }
          }
        },
        "security": [
          {
            "ApiKey": [],
            "ContextToken": []
          }
        ]
      }
    },
    "/guided-shopping/appointment/presentation/{presentationCmsPageId}/slide/{sectionId}": {
      "get": {
        "tags": [
          "Presentation"
        ],
        "summary": "Fetch resolved data for specific slide",
        "description": "Gives the resolved slot-data for the given slide index (slot-config)",
        "operationId": "getSlideData",
        "parameters": [
          {
            "name": "presentationCmsPageId",
            "in": "path",
            "description": "Presentation CMS page id for which the data is requested",
            "required": true,
            "schema": {
              "type": "string",
              "pattern": "^[0-9a-f]{32}$"
            }
          },
          {
            "name": "sectionId",
            "in": "path",
            "description": "CMS section id for which the data is requested",
            "required": true,
            "schema": {
              "type": "string",
              "pattern": "^[0-9a-f]{32}$"
            }
          }
        ],
        "responses": {
          "200": {
            "description": "",
            "content": {
              "application/json": {
                "schema": {
                  "$ref": "#/components/schemas/PresentationSlideData"
                }
              }
            }
          }
        },
        "security": [
          {
            "ApiKey": [],
            "ContextToken": []
          }
        ]
      }
    },
    "/guided-shopping/appointment/presentation/state": {
      "get": {
        "tags": [
          "Presentation"
        ],
        "summary": "Get the current presentation state",
        "description": "Returns the presentation state for all and the client",
        "operationId": "getClientPresentationState",
        "parameters": [],
        "responses": {
          "200": {
            "description": "",
            "content": {
              "application/json": {
                "schema": {
                  "$ref": "#/components/schemas/ClientPresentationStateResponse"
                }
              }
            }
          }
        },
        "security": [
          {
            "ApiKey": [],
            "ContextToken": []
          }
        ]
      }
    },
    "/guided-shopping/quickview/{productId}/{cmsPageLayoutId}": {
      "get": {
        "tags": [
          "Presentation"
        ],
        "summary": "Fetch a cms page for quickview with product data",
        "description": "Takes a product identifier and returns the preconfigured quickview CMS layout (defined in SwagGuidedShopping.config.quickviewPageId ) hydrated with the product specific data",
        "operationId": "resolveQuickviewPage",
        "parameters": [
          {
            "name": "productId",
            "in": "path",
            "description": "The product id",
            "required": true,
            "schema": {
              "type": "string",
              "pattern": "^[0-9a-f]{32}$"
            }
          },
          {
            "name": "cmsPageLayoutId",
            "in": "path",
            "description": "The cms page id using as product quick view",
            "required": true,
            "schema": {
              "type": "string",
              "pattern": "^[0-9a-f]{32}$"
            }
          }
        ],
        "responses": {
          "200": {
            "description": "",
            "content": {
              "application/json": {
                "schema": {
                  "type": "object",
                  "properties": {
                    "cmsPage": {
                      "$ref": "#/components/schemas/CmsPage"
                    },
                    "product": {
                      "$ref": "#/components/schemas/Product"
                    },
                    "configurator": {
                      "type": "array",
                      "items": {
                        "$ref": "#/components/schemas/PropertyGroup"
                      }
                    }
                  }
                }
              }
            }
          }
        },
        "security": [
          {
            "ApiKey": [],
            "ContextToken": []
          }
        ]
      }
    }
  }
}
