<svg width="129" height="133" viewBox="0 0 129 133" fill="none" xmlns="http://www.w3.org/2000/svg">
<mask id="mask0" mask-type="alpha" maskUnits="userSpaceOnUse" x="21" y="23" width="88" height="88">
<path fill-rule="evenodd" clip-rule="evenodd" d="M21 23H109V111H21V23Z" fill="white"/>
</mask>
<g mask="url(#mask0)">
<path fill-rule="evenodd" clip-rule="evenodd" d="M65 23C89.301 23 109 42.699 109 67C109 91.301 89.301 111 65 111C40.7 111 21 91.301 21 67C21 42.699 40.7 23 65 23" fill="#FFF3B3"/>
<mask id="mask1" mask-type="alpha" maskUnits="userSpaceOnUse" x="21" y="23" width="88" height="88">
<path fill-rule="evenodd" clip-rule="evenodd" d="M65 23C89.301 23 109 42.699 109 67C109 91.301 89.301 111 65 111C40.7 111 21 91.301 21 67C21 42.699 40.7 23 65 23" fill="white"/>
</mask>
<g mask="url(#mask1)">
<rect x="34.5" y="61.5" width="61" height="56" fill="white" stroke="#FFD700"/>
<path d="M38 57.5H92C93.933 57.5 95.5 59.067 95.5 61V61.5H34.5V61C34.5 59.067 36.067 57.5 38 57.5Z" fill="#FFDD26" stroke="#FFD700"/>
<rect x="39.5" y="66.5" width="36" height="8" rx="1.5" fill="#FFFAE0" stroke="#FFD700"/>
<rect x="80.5" y="66.5" width="9" height="8" rx="1.5" fill="#FFFAE0" stroke="#FFD700"/>
<path d="M42 79.5H56C56.8284 79.5 57.5 80.1716 57.5 81V100C57.5 100.828 56.8284 101.5 56 101.5H42C41.1716 101.5 40.5 100.828 40.5 100V81C40.5 80.1716 41.1716 79.5 42 79.5Z" fill="#FFFAE0" stroke="#FFD700"/>
<rect x="62.5" y="79.5" width="27" height="22" rx="1.5" fill="#FFFAE0" stroke="#FFD700"/>
<mask id="mask2" mask-type="alpha" maskUnits="userSpaceOnUse" x="63" y="80" width="26" height="21">
<rect x="63.5" y="80.5" width="25" height="20" rx="0.5" fill="#FFFAE0" stroke="#FFD700"/>
</mask>
<g mask="url(#mask2)">
<path d="M79.3493 90.0018L90.5022 101.978C91.3955 102.937 90.7153 104.5 89.4045 104.5H68.2704C66.9986 104.5 66.3039 103.017 67.1181 102.04L77.0993 90.0637C77.6776 89.3697 78.7336 89.3407 79.3493 90.0018Z" fill="#FFF3B3" stroke="#FFD700"/>
<path d="M73.3493 93.0018L84.5022 104.978C85.3955 105.937 84.7153 107.5 83.4045 107.5H62.2704C60.9986 107.5 60.3039 106.017 61.1181 105.04L71.0993 93.0637C71.6776 92.3697 72.7336 92.3407 73.3493 93.0018Z" fill="#FFF3B3" stroke="#FFD700" stroke-linecap="round"/>
<circle cx="68.5" cy="85.5" r="2" fill="#FFF3B3" stroke="#FFD700" stroke-linecap="round"/>
</g>
</g>
</g>
<line x1="44.5" y1="83.5" x2="53.5" y2="83.5" stroke="#FFD700" stroke-linecap="round"/>
<line x1="44.5" y1="87.5" x2="50.5" y2="87.5" stroke="#FFD700" stroke-linecap="round"/>
<line x1="44.5" y1="91.5" x2="53.5" y2="91.5" stroke="#FFD700" stroke-linecap="round"/>
</svg>
