{
    "openapi": "3.0.0",
    "info": [],
    "paths": [],
    "components": {
        "schemas": {
            "StateForGuides": {
                "type": "object",
                "properties": {
                    "clients": {
                        "type": "array",
                        "items": {
                            "type": "string"
                        },
                        "default": []
                    },
                    "inactiveClients": {
                        "type": "array",
                        "items": {
                            "type": "string"
                        },
                        "default": []
                    },
                    "guides": {
                        "type": "array",
                        "items": {
                            "type": "string"
                        },
                        "default": []
                    },
                    "videoGuideToken": {
                        "anyOf": [
                            {
                                "type": "string"
                            },
                            {
                                "type": "null"
                            }
                        ]
                    },
                    "quickViewState": {
                        "type": "array",
                        "items": {
                            "type": "string"
                        },
                        "default": []
                    },
                    "extensions": {
                        "type": "array",
                        "default": []
                    }
                }
            }
        }
    }
}
