<svg width="24" height="24" viewBox="0 0 24 24" fill="none" xmlns="http://www.w3.org/2000/svg">
<path fill-rule="evenodd" clip-rule="evenodd" d="M5 23C3.34315 23 2 21.6569 2 20C2 18.603 2.95486 17.429 4.24752 17.0952L4.69039 15.7666C3.68249 15.3428 2.94961 14.3834 2.8609 13.2301L2.15634 4.07081C2.10986 3.46658 1.60601 3 1 3C0.447715 3 0 2.55228 0 2C0 1.44772 0.447715 1 1 1C2.65109 1 4.02381 2.27119 4.15045 3.91741L23 3.94461C23.6306 3.94461 24.1038 4.52119 23.9808 5.13969L22.301 13.5852C22.0218 14.989 20.7899 16 19.3586 16H6.72076L6.29044 17.291C7.00909 17.6339 7.56987 18.2544 7.8341 19.0137C7.88806 19.0047 7.94348 19 8 19H16.1707C16.5825 17.8348 17.6938 17 19 17C20.6569 17 22 18.3431 22 20C22 21.6569 20.6569 23 19 23C17.6938 23 16.5825 22.1652 16.1707 21H8C7.94348 21 7.88806 20.9953 7.8341 20.9863C7.42615 22.1586 6.31133 23 5 23ZM4.98355 19.0001C4.43885 19.0089 4 19.4532 4 20C4 20.5523 4.44772 21 5 21C5.55228 21 6 20.5523 6 20C6 19.4533 5.56122 19.009 5.01659 19.0001C5.0056 19.0003 4.99458 19.0003 4.98355 19.0001ZM19 21C19.5523 21 20 20.5523 20 20C20 19.4477 19.5523 19 19 19C18.4477 19 18 19.4477 18 20C18 20.5523 18.4477 21 19 21Z" fill="#758CA3"/>
</svg>
