{
  "prepare_queue": {
    "installed": [],
    "uninstalled": []
  },
  "config_munge": {
    "files": {
      "config.xml": {
        "parents": {
          "/*": [
            {
              "xml": "<feature name=\"VIDVOCRPlugin\"><param name=\"ios-package\" value=\"VIDVOCRPlugin\" /></feature>",
              "count": 1
            }
          ]
        }
      }
    }
  },
  "installed_plugins": {
    "cordova-plugin-vidvocr": {
      "PACKAGE_NAME": "me.valify.ocrsampleapp"
    }
  },
  "dependent_plugins": {},
  "modules": [
    {
      "id": "cordova-plugin-vidvocr.VIDVOCRPlugin",
      "file": "plugins/cordova-plugin-vidvocr/www/VIDVOCRPlugin.js",
      "pluginId": "cordova-plugin-vidvocr",
      "clobbers": [
        "VIDVOCRPlugin"
      ]
    }
  ],
  "plugin_metadata": {
    "cordova-plugin-vidvocr": "0.0.1-alpha08"
  }
}
