<svg width="20" height="20" viewBox="0 0 20 20" xmlns="http://www.w3.org/2000/svg">
    <path d="M16 10C16 10.5523 15.5523 11 15 11L5 11C4.44771 11 4 10.5523 4 10V10C4 9.44771 4.44772 9 5 9L15 9C15.5523 9 16 9.44772 16 10V10Z M10 16C9.44772 16 9 15.5523 9 15L9 5C9 4.44772 9.44772 4 10 4V4C10.5523 4 11 4.44772 11 5L11 15C11 15.5523 10.5523 16 10 16V16Z" />
</svg>
