<svg xmlns="http://www.w3.org/2000/svg" width="60.09" height="77.4" viewBox="0 0 60.09 77.4">
  <g id="light-bulb" transform="translate(0.017)">
    <g id="Group_699" data-name="Group 699" transform="translate(0.044 43.219)">
      <g id="Path_9720" data-name="Path 9720" transform="translate(1.378 -1.189)" fill="none">
        <path d="M28.721,1.189C43.277,1.189,56.133,8.694,56.133,17S44.383,32.97,28.721,32.97.962,25.627.962,17,14.165,1.189,28.721,1.189Z" stroke="none"/>
        <path d="M 28.72091102600098 1.188961029052734 C 14.16524124145508 1.188961029052734 0.9619102478027344 8.373390197753906 0.9619102478027344 17 C 0.9619102478027344 25.62660980224609 13.05850219726563 32.97034072875977 28.72091102600098 32.97034072875977 C 44.38332366943359 32.97034072875977 56.13287353515625 25.3056812286377 56.13287353515625 17 C 56.13287353515625 8.694320678710938 43.27657318115234 1.188961029052734 28.72091102600098 1.188961029052734 M 28.72091102600098 -1.211040496826172 C 32.4658317565918 -1.211040496826172 36.17333984375 -0.7475395202636719 39.74047088623047 0.1665725708007813 C 43.18618011474609 1.049571990966797 46.33110046386719 2.306650161743164 49.08787155151367 3.902900695800781 C 51.92303085327148 5.544530868530273 54.18212127685547 7.45012092590332 55.80237197875977 9.566740036010742 C 57.61420059204102 11.9336109161377 58.53287124633789 14.43452072143555 58.53287124633789 17 C 58.53287124633789 19.55615043640137 57.68266296386719 22.04365158081055 56.0058708190918 24.39340972900391 C 54.45964050292969 26.56019973754883 52.28435134887695 28.4985408782959 49.54041290283203 30.15458106994629 C 43.96744155883789 33.51800918579102 36.57360076904297 35.37034225463867 28.72091102600098 35.37034225463867 C 20.80021286010742 35.37034225463867 13.35480117797852 33.56673049926758 7.756202697753906 30.29175186157227 C 4.950839996337891 28.65071105957031 2.729442596435547 26.71673202514648 1.153720855712891 24.54352188110352 C -0.5660781860351563 22.17160034179688 -1.438087463378906 19.63359069824219 -1.438087463378906 17 C -1.438087463378906 14.35699081420898 -0.4977264404296875 11.80606079101563 1.35687255859375 9.418071746826172 C 3.006233215332031 7.294340133666992 5.311351776123047 5.392950057983398 8.20819091796875 3.766721725463867 C 10.99162292480469 2.204151153564453 14.17483139038086 0.9758224487304688 17.66939163208008 0.1158523559570313 C 21.2471809387207 -0.7646102905273438 24.96545028686523 -1.211040496826172 28.72091102600098 -1.211040496826172 Z" stroke="none" fill="#f13566"/>
      </g>
      <g id="Path_9721" data-name="Path 9721" transform="translate(0.378 -0.189)" fill="#fff">
        <path d="M 5.6220703125 11.30354022979736 C 2.975340366363525 11.30354022979736 0.822070300579071 9.150270462036133 0.822070300579071 6.5035400390625 C 0.822070300579071 3.856810092926025 2.975340366363525 1.703540086746216 5.6220703125 1.703540086746216 C 8.268800735473633 1.703540086746216 10.42207050323486 3.856810092926025 10.42207050323486 6.5035400390625 C 10.42207050323486 9.150270462036133 8.268800735473633 11.30354022979736 5.6220703125 11.30354022979736 Z" stroke="none"/>
        <path d="M 5.6220703125 2.903539657592773 C 3.637020111083984 2.903539657592773 2.022069931030273 4.518489837646484 2.022069931030273 6.5035400390625 C 2.022069931030273 8.488590240478516 3.637020111083984 10.10354042053223 5.6220703125 10.10354042053223 C 7.607120513916016 10.10354042053223 9.222070693969727 8.488590240478516 9.222070693969727 6.5035400390625 C 9.222070693969727 4.518489837646484 7.607120513916016 2.903539657592773 5.6220703125 2.903539657592773 M 5.6220703125 0.5035400390625 C 8.93578052520752 0.5035400390625 11.6220703125 3.18982982635498 11.6220703125 6.5035400390625 C 11.6220703125 9.81725025177002 8.93578052520752 12.5035400390625 5.6220703125 12.5035400390625 C 2.30836009979248 12.5035400390625 -0.3779296875 9.81725025177002 -0.3779296875 6.5035400390625 C -0.3779296875 3.18982982635498 2.30836009979248 0.5035400390625 5.6220703125 0.5035400390625 Z" stroke="none" fill="#332164"/>
      </g>
      <g id="Path_9722" data-name="Path 9722" transform="translate(2.298 -0.189)" fill="#fff">
        <path d="M 51.7314453125 30.67072677612305 C 49.084716796875 30.67072677612305 46.93144607543945 28.51745796203613 46.93144607543945 25.8707275390625 C 46.93144607543945 23.22399711608887 49.084716796875 21.07072830200195 51.7314453125 21.07072830200195 C 54.378173828125 21.07072830200195 56.53144454956055 23.22399711608887 56.53144454956055 25.8707275390625 C 56.53144454956055 28.51745796203613 54.378173828125 30.67072677612305 51.7314453125 30.67072677612305 Z" stroke="none"/>
        <path d="M 51.7314453125 22.27072715759277 C 49.74639511108398 22.27072715759277 48.13144683837891 23.88567733764648 48.13144683837891 25.8707275390625 C 48.13144683837891 27.85577774047852 49.74639511108398 29.47072792053223 51.7314453125 29.47072792053223 C 53.71649551391602 29.47072792053223 55.33144378662109 27.85577774047852 55.33144378662109 25.8707275390625 C 55.33144378662109 23.88567733764648 53.71649551391602 22.27072715759277 51.7314453125 22.27072715759277 M 51.7314453125 19.8707275390625 C 55.0451545715332 19.8707275390625 57.7314453125 22.5570182800293 57.7314453125 25.8707275390625 C 57.7314453125 29.1844367980957 55.0451545715332 31.8707275390625 51.7314453125 31.8707275390625 C 48.4177360534668 31.8707275390625 45.7314453125 29.1844367980957 45.7314453125 25.8707275390625 C 45.7314453125 22.5570182800293 48.4177360534668 19.8707275390625 51.7314453125 19.8707275390625 Z" stroke="none" fill="#332164"/>
      </g>
    </g>
    <path id="Path_9709" data-name="Path 9709" d="M96.163,62.58l1.286-1.364a12.869,12.869,0,0,0,2.718,1.2v1.828a1.254,1.254,0,0,0,1.216,1.289h4.864a1.255,1.255,0,0,0,1.216-1.289V62.421a12.823,12.823,0,0,0,2.733-1.189l1.271,1.347a1.166,1.166,0,0,0,1.719,0l3.648-3.868a1.345,1.345,0,0,0,0-1.823l-1.271-1.347a14.475,14.475,0,0,0,1.122-2.9h1.722a1.255,1.255,0,0,0,1.216-1.289V46.2a1.255,1.255,0,0,0-1.216-1.289h-1.724a14.607,14.607,0,0,0-1.135-2.882l1.287-1.364a1.345,1.345,0,0,0,0-1.823l-3.648-3.868a1.167,1.167,0,0,0-1.719,0l-1.287,1.364a12.912,12.912,0,0,0-2.717-1.2V33.3a1.255,1.255,0,0,0-1.216-1.289h-4.864a1.255,1.255,0,0,0-1.216,1.289v1.826a12.842,12.842,0,0,0-2.733,1.189l-1.271-1.348a1.167,1.167,0,0,0-1.719,0L90.8,38.837a1.343,1.343,0,0,0,0,1.823l1.271,1.348a14.41,14.41,0,0,0-1.122,2.9H89.224A1.255,1.255,0,0,0,88.008,46.2v5.158a1.254,1.254,0,0,0,1.216,1.289h1.724a14.524,14.524,0,0,0,1.135,2.882L90.8,56.888a1.343,1.343,0,0,0,0,1.823l3.648,3.868A1.166,1.166,0,0,0,96.163,62.58Zm-1.53-7.552A11.916,11.916,0,0,1,93.09,51.1a1.235,1.235,0,0,0-1.19-1.033H90.44V47.485H91.9a1.236,1.236,0,0,0,1.192-1.033A11.89,11.89,0,0,1,94.618,42.5a1.349,1.349,0,0,0-.163-1.611l-1.079-1.145L95.3,37.7l1.079,1.145a1.163,1.163,0,0,0,1.519.171,10.5,10.5,0,0,1,3.723-1.617,1.274,1.274,0,0,0,.974-1.264V34.591h2.432v1.549A1.273,1.273,0,0,0,106,37.4a10.484,10.484,0,0,1,3.708,1.636,1.162,1.162,0,0,0,1.518-.173l1.1-1.163,1.928,2.045-1.1,1.162A1.349,1.349,0,0,0,113,42.521a11.9,11.9,0,0,1,1.543,3.931,1.235,1.235,0,0,0,1.19,1.033h1.461v2.579H115.73a1.237,1.237,0,0,0-1.192,1.033,11.891,11.891,0,0,1-1.525,3.948,1.349,1.349,0,0,0,.161,1.611l1.08,1.145-1.928,2.046-1.08-1.145a1.163,1.163,0,0,0-1.519-.171A10.493,10.493,0,0,1,106,60.146a1.274,1.274,0,0,0-.974,1.264v1.548H102.6V61.409a1.273,1.273,0,0,0-.974-1.264,10.481,10.481,0,0,1-3.707-1.636,1.165,1.165,0,0,0-1.519.173l-1.1,1.164L93.375,57.8l1.1-1.162A1.348,1.348,0,0,0,94.633,55.028Zm0,0" transform="translate(-73.826 -26.852)" fill="#332164"/>
    <path id="Path_9710" data-name="Path 9710" d="M145.09,98.73a9.026,9.026,0,1,0-9.026-9.026A9.036,9.036,0,0,0,145.09,98.73Zm0-15.473a6.447,6.447,0,1,1-6.447,6.447A6.455,6.455,0,0,1,145.09,83.258Zm0,0" transform="translate(-115.043 -67.608)" fill="#f13566"/>
    <path id="Path_9711" data-name="Path 9711" d="M38.512,43.415c0-1.817,2.6-4.407,3.54-5.079A21.142,21.142,0,0,0,28.679.024a21.237,21.237,0,0,0-11.437,38.4,10.179,10.179,0,0,1,3.443,4.989C20.761,43.462,38.517,43.415,38.512,43.415ZM10.981,20.726A18.8,18.8,0,0,1,28.8,2.522,18.745,18.745,0,0,1,48.463,21.244,18.78,18.78,0,0,1,40.6,36.493a11.306,11.306,0,0,0-4.589,8.493H23.434A11.432,11.432,0,0,0,18.712,36.4,18.753,18.753,0,0,1,10.981,20.726Zm12.49,34.258v-2.5h12.5v2.5Zm9.767,2.5a3.727,3.727,0,0,1-7.038,0Zm-9.767-7.5v-2.5h12.5v2.5Zm-2.785-6.57s.212,1.042.25,1.572H18.472v2.5h2.5v2.5h-2.5v2.5h2.5v3.749a1.25,1.25,0,0,0,1.25,1.25H23.6a6.248,6.248,0,0,0,12.244,0h1.376a1.25,1.25,0,0,0,1.25-1.25V52.484h2.5v-2.5h-2.5v-2.5h2.5v-2.5H38.512c.045-.537,0-1.572,0-1.572Z" transform="translate(0.271 0.001)" fill="#332164"/>
    <path id="Path_9723" data-name="Path 9723" d="M-10279.284,1069.484a14.791,14.791,0,0,1,1.714,4.344l12.327.173a13.578,13.578,0,0,1,1.531-4.19C-10264.946,1068.59-10275.819,1068.479-10279.284,1069.484Z" transform="translate(10301.374 -1030.037)" fill="#fff"/>
  </g>
</svg>
