<svg xmlns="http://www.w3.org/2000/svg" width="9.701" height="16" viewBox="0 0 9.701 16">
  <path id="Path_17454" data-name="Path 17454" d="M330.819,280.727a.5.5,0,0,1,.5.478l.058.986a.167.167,0,0,0,.166.157h3.235a.3.3,0,0,1-.133-.039.217.217,0,0,0,.024-.019.165.165,0,0,0,.039-.132l-.8-5.73a.5.5,0,0,1,.494-.569h1.039a.167.167,0,0,0,.166-.167v-2.077a.167.167,0,0,0-.166-.167h-2.038a.166.166,0,0,1-.109-.292,3.877,3.877,0,1,0-5.074,0,.167.167,0,0,1-.109.292h-2.039a.167.167,0,0,0-.165.167v2.077a.167.167,0,0,0,.166.167h1.041a.5.5,0,0,1,.495.568l-.791,5.731a.166.166,0,0,0,.04.132.164.164,0,0,0,.126.057h3a.168.168,0,0,0,.161-.157l.056-.983a.5.5,0,0,1,.5-.482Zm-.857-8.492a.1.1,0,0,1-.025-.084l.279-2a.1.1,0,0,0-.04-.1.967.967,0,1,1,1.142.023.105.105,0,0,0-.044.1l.313,1.974a.105.105,0,0,1-.1.121h-1.443a.106.106,0,0,1-.079-.036Z" transform="translate(-325.912 -266.349)" fill="#f36" fill-rule="evenodd"/>
</svg>
