{
    "userId": "12345",
    "role": ["A01"], 
    "office": {
        "id": 1,
        "fractional": "ABCDEFG"
    },
 
    "contabilizationDate": "2019-10-08T10:10:05.000Z", 
    "branchNumber": "1234567", 
    "operationNumber":"12",  
    "phase": "5",  
    "state":"A",  
    "originalOperationNumber":"11",
    "restartLevel": "1",
    "channel": "",
    "compliance": "",
    "client": ""
}