
per startarlo:
cd .....\nifi-1.8.0-bin\nifi-1.8.0\bin
es:
cd C:\DEV\BIG-DATA\nifi-1.8.0-bin\nifi-1.8.0\bin

run-nifi.bat

dopo un po' si puo' raggiungre la console alla seguente url:

http://localhost:9090/nifi/

per stopparlo: control x
******************************************************************************

per indicare il path di un file properties esternalizzato
valorizzare nifi.variable.registry.properties
dentro nifi.properties sotto  C:\DEV\BIG-DATA\nifi-1.8.0-bin\nifi-1.8.0\conf

es:
nifi.variable.registry.properties=./conf/gpec.properties
******************************************************************************
