${AnsiColor.RED}     ______    ____                               ______           __
${AnsiColor.RED}    / ____/   / __ \  ___   _____                / ____/  ____ _  / /_  ___  _      __  ____ _   __  __
${AnsiColor.RED}   / / __    / /_/ / / _ \ / ___/               / / __   / __ `/ / __/ / _ \| | /| / / / __ `/  / / / /
${AnsiColor.RED}  / /_/ /   / ____/ /  __// /__                / /_/ /  / /_/ / / /_  /  __/| |/ |/ / / /_/ /  / /_/ /
${AnsiColor.RED}  \____/   /_/      \___/ \___/                \____/   \__,_/  \__/  \___/ |__/|__/  \__,_/   \__, /
${AnsiColor.RED}                                                                                             /____/
