${AnsiColor.GREEN}  _________________                     ________                _________
${AnsiColor.GREEN}  __  ____/___  __ \_____ _______       ___  __ \______________ ______  /____  ______________ ________
${AnsiColor.GREEN}  _  / __  __  /_/ /_  _ \_  ___/       __  /_/ /__  ___/_  __ \_  __  / _  / / /_  ___/_  _ \__  ___/
${AnsiColor.GREEN}  / /_/ /  _  ____/ /  __// /__         _  ____/ _  /    / /_/ // /_/ /  / /_/ / / /__  /  __/_  /
${AnsiColor.GREEN}  \____/   /_/      \___/ \___/         /_/      /_/     \____/ \__,_/   \__,_/  \___/  \___/ /_/
${AnsiColor.GREEN}
