{
	"@navbar-bg" : "transparent",
	"@navbar-color" : "red !important",
	"@navbar-hover-color" : "#ffffff",
	"@logo-altura" : "60px",
	"@color-font": "red",
	"@nav-active-color": "red",
	"@nav-item-color": "#fff",
	"@nav-text-caixa": "uppercase"
}