{
  "questions": [
    {
      "question": "Quanto ne sai di computer?",
      "answers": [
        "Non molto...",
        "So arrangiarmi la maggior parte delle volte",
        "Diciamo che smanetto parecchio!"
      ]
    },
    {
      "question": "Hai già esperienza con Linux?",
      "answers": [
        "Mai visto neanche da lontano",
        "Ho provato con qualche altra persona",
        "Si, lo uso regolarmente"
      ]
    },
    {
      "question": "Quale tra queste è la tua priorità?",
      "answers": [
        "Semplicità d'uso",
        "Applicazioni sempre aggiornate all'ultima versione",
        "Massimo controllo del sistema"
      ]
    },
    {
      "question": "Quanti anni ha il PC su cui vorresti installare Linux?",
      "answers": [
        "Meno di due",
        "Da due a cinque",
        "Più di cinque"
      ]
    }
  ],
  "distributions": [
    {
      "name": "Mint",
      "website": "http://www.linuxmint.com/",
      "logo": "/images/distro_mint.png",
      "answers": [0, 0, 0, 0]
    },
    {
      "name": "Elementary",
      "website": "https://elementary.io/",
      "logo": "/images/distro_elementary.png",
      "answers": [0, 0, 0, 1]
    },
    {
      "name": "Lubuntu",
      "website": "https://lubuntu.me/",
      "logo": "/images/distro_lubuntu.png",
      "answers": [0, 0, 0, 2]
    },
    {
      "name": "Ubuntu",
      "website": "http://www.ubuntu-it.org/",
      "logo": "/images/distro_ubuntu.png",
      "answers": [0, 1, 0, 0]
    },
    {
      "name": "Fedora",
      "website": "https://getfedora.org/it/",
      "logo": "/images/distro_fedora.png",
      "answers": [0, 1, 1, 0]
    },
    {
      "name": "Mageia",
      "website": "http://www.mageia.org/it/",
      "logo": "/images/distro_mageia.png",
      "answers": [1, 1, 0, 0]
    },
    {
      "name": "openSUSE",
      "website": "https://it.opensuse.org/",
      "logo": "/images/distro_opensuse.png",
      "answers": [1, 2, 1, 0]
    },
    {
      "name": "Debian",
      "website": "https://www.debian.org/index.it.html",
      "logo": "/images/distro_debian.png",
      "answers": [2, 2, 2, 1]
    },
    {
      "name": "Arch",
      "website": "http://www.archlinux.it/",
      "logo": "/images/distro_arch.png",
      "answers": [2, 2, 1, 0]
    }
  ]
}
