<?xml version="1.0" encoding="UTF-8" standalone="no"?>
<!-- Created with Inkscape (http://www.inkscape.org/) -->

<svg
   version="1.1"
   id="svg2"
   xml:space="preserve"
   width="793.76001"
   height="446.05301"
   viewBox="0 0 793.76001 446.05303"
   sodipodi:docname="sfondo-169.svg"
   inkscape:version="1.1.2 (0a00cf5339, 2022-02-04)"
   xmlns:inkscape="http://www.inkscape.org/namespaces/inkscape"
   xmlns:sodipodi="http://sodipodi.sourceforge.net/DTD/sodipodi-0.dtd"
   xmlns="http://www.w3.org/2000/svg"
   xmlns:svg="http://www.w3.org/2000/svg"><defs
     id="defs6"><clipPath
       clipPathUnits="userSpaceOnUse"
       id="clipPath20"><path
         d="M -566.71997,0.16 H 0.16 V 436 h -566.87997 z"
         clip-rule="evenodd"
         id="path18" /></clipPath><clipPath
       clipPathUnits="userSpaceOnUse"
       id="clipPath30"><path
         d="m -131.03999,-428.16 h 559.36 V 0.16 h -559.36 z"
         clip-rule="evenodd"
         id="path28" /></clipPath><clipPath
       clipPathUnits="userSpaceOnUse"
       id="clipPath64"><path
         d="M 32.799999,0 H 299.84 V 124.64 H 32.799999 Z"
         clip-rule="evenodd"
         id="path62" /></clipPath></defs><sodipodi:namedview
     id="namedview4"
     pagecolor="#ffffff"
     bordercolor="#666666"
     borderopacity="1.0"
     inkscape:pageshadow="2"
     inkscape:pageopacity="0.0"
     inkscape:pagecheckerboard="0"
     showgrid="false"
     fit-margin-top="0"
     fit-margin-left="0"
     fit-margin-right="0"
     fit-margin-bottom="0"
     inkscape:zoom="0.58781078"
     inkscape:cx="927.16911"
     inkscape:cy="244.12618"
     inkscape:window-width="1600"
     inkscape:window-height="837"
     inkscape:window-x="0"
     inkscape:window-y="0"
     inkscape:window-maximized="1"
     inkscape:current-layer="g8" /><g
     id="g8"
     inkscape:groupmode="layer"
     inkscape:label="visual-identity-stub"
     transform="translate(-0.1555729,-0.49044884)"><g
       id="g10"
       transform="matrix(1,0,0,0.39735337,0.3155729,0.55402538)"><path
         d="M -0.16,-0.16 H 793.59998 V 1122.4 H -0.16 Z"
         style="fill:#ffa200;fill-opacity:1;fill-rule:evenodd;stroke:none"
         id="path12" /></g><g
       id="g987"
       transform="matrix(1.2189191,0,0,1.1078266,0.01825173,0)"><g
         id="g14"
         transform="translate(566.71997,-0.16)"><g
           id="g16"
           clip-path="url(#clipPath20)"><path
             d="m 0,0 c 0,240.64 -195.03999,435.84 -435.67999,435.84 -44.48001,0 -88.79999,-6.72 -131.20001,-20.16001 V 0 Z"
             style="fill:#5b5b5b;fill-opacity:1;fill-rule:evenodd;stroke:none"
             id="path22" /></g></g><g
         id="g24"
         transform="translate(131.03999,428.16)"><g
           id="g26"
           clip-path="url(#clipPath30)"><path
             d="m 0,0 c -45.759998,0 -89.760002,-7.2 -131.2,-20.48 v -407.84001 h 559.36 v 0 0 C 428.16,-191.84 236.48,0 0,0 Z"
             style="fill:#dbdbdb;fill-opacity:1;fill-rule:evenodd;stroke:none"
             id="path32" /></g></g></g><g
       id="g979"
       transform="translate(22,-18)"><g
         id="g34"
         transform="translate(717.91998,37.599998)"><path
           d="M 0,-2 C 20.959999,-2 37.919998,14.959999 37.919998,35.919998 37.919998,56.720001 20.959999,73.68 0,73.68 -20.799999,73.68 -37.759998,56.720001 -37.759998,35.919998 -37.759998,14.959999 -20.799999,-2 0,-2 Z"
           style="fill:#000000;fill-opacity:1;fill-rule:evenodd;stroke:none"
           id="path36" /></g><g
         id="g38"><path
           d="M 703.84003,79.360001 H 717.91998 732 l -7.03998,11.36 L 717.91998,102.24 710.88,90.720001 Z"
           style="fill:#ffa200;fill-opacity:1;fill-rule:evenodd;stroke:none"
           id="path40" /></g><g
         id="g42"
         transform="translate(704.96002,53.279999)"><path
           d="m 0,0 c -6.56,0 -12,5.44 -12,12 0,6.719999 5.44,12.16 12,12.16 C 6.72,24.16 12.16,18.719999 12.16,12 12.16,5.44 6.72,0 0,0 Z"
           style="fill:#fefefe;fill-opacity:1;fill-rule:evenodd;stroke:none"
           id="path44" /></g><g
         id="g46"
         transform="translate(730.88,53.279999)"><path
           d="M 0,0 C 6.72,0 12.16,5.44 12.16,12 12.16,18.719999 6.72,24.16 0,24.16 -6.56,24.16 -12,18.719999 -12,12 -12,5.44 -6.56,0 0,0 Z"
           style="fill:#fefefe;fill-opacity:1;fill-rule:evenodd;stroke:none"
           id="path48" /></g><g
         id="g50"
         transform="translate(711.52002,61.279999)"><path
           d="M 0,0 C -2.24,0 -4,1.76 -4,4 -4,6.4 -2.24,8.16 0,8.16 2.4,8.16 4.16,6.4 4.16,4 4.16,1.76 2.4,0 0,0 Z"
           style="fill:#000000;fill-opacity:1;fill-rule:evenodd;stroke:none"
           id="path52" /></g><g
         id="g54"
         transform="translate(724.32001,61.279999)"><path
           d="M 0,0 C 2.4,0 4.16,1.76 4.16,4 4.16,6.4 2.4,8.16 0,8.16 -2.24,8.16 -4,6.4 -4,4 -4,1.76 -2.24,0 0,0 Z"
           style="fill:#000000;fill-opacity:1;fill-rule:evenodd;stroke:none"
           id="path56" /></g></g><g
       id="g58" /><g
       id="g68"
       transform="translate(0,-37.82855)"><path
         d="M 37.599998,107.2 H 300.64001 V 99.519997 H 37.599998 Z"
         style="fill:#ffa200;fill-opacity:1;fill-rule:evenodd;stroke:none"
         id="path70" /></g></g></svg>
