<?xml version="1.0" encoding="UTF-8" standalone="no"?>
<svg
   xmlns:dc="http://purl.org/dc/elements/1.1/"
   xmlns:cc="http://creativecommons.org/ns#"
   xmlns:rdf="http://www.w3.org/1999/02/22-rdf-syntax-ns#"
   xmlns:svg="http://www.w3.org/2000/svg"
   xmlns="http://www.w3.org/2000/svg"
   xmlns:sodipodi="http://sodipodi.sourceforge.net/DTD/sodipodi-0.dtd"
   xmlns:inkscape="http://www.inkscape.org/namespaces/inkscape"
   sodipodi:docname="svg_servizi.svg"
   inkscape:version="1.0 (4035a4fb49, 2020-05-01)"
   id="svg8"
   version="1.1"
   viewBox="0 0 144.05609 144.31006"
   height="144.31006mm"
   width="144.05609mm">
  <defs
     id="defs2" />
  <sodipodi:namedview
     inkscape:window-maximized="1"
     inkscape:window-y="-8"
     inkscape:window-x="-8"
     inkscape:window-height="1017"
     inkscape:window-width="1920"
     fit-margin-bottom="0"
     fit-margin-right="0"
     fit-margin-left="0"
     fit-margin-top="0"
     showguides="false"
     showgrid="false"
     inkscape:document-rotation="0"
     inkscape:current-layer="layer1"
     inkscape:document-units="mm"
     inkscape:cy="360.86693"
     inkscape:cx="238.97314"
     inkscape:zoom="0.49497475"
     inkscape:pageshadow="2"
     inkscape:pageopacity="0.0"
     borderopacity="1.0"
     bordercolor="#666666"
     pagecolor="#ffffff"
     id="base" />
  <metadata
     id="metadata5">
    <rdf:RDF>
      <cc:Work
         rdf:about="">
        <dc:format>image/svg+xml</dc:format>
        <dc:type
           rdf:resource="http://purl.org/dc/dcmitype/StillImage" />
        <dc:title></dc:title>
      </cc:Work>
    </rdf:RDF>
  </metadata>
  <g
     transform="translate(-30.38783,-18.095081)"
     id="layer1"
     inkscape:groupmode="layer"
     inkscape:label="Livello 1">
    <path
       id="path847"
       d="m 92.455632,160.08779 c -9.42476,-1.30963 -17.19504,-2.44025 -17.26729,-2.5125 -0.12941,-0.1294 1.37458,-11.92288 1.74078,-13.65028 0.15652,-0.73831 -0.14991,-1.05875 -1.8233,-1.90673 -1.1063,-0.5606 -2.95476,-1.6227 -4.1077,-2.36023 l -2.09626,-1.34096 -5.72505,4.3563 c -3.14877,2.39596 -5.86786,4.30583 -6.04242,4.24415 -0.41955,-0.14825 -21.48061,-27.85629 -21.48061,-28.26 0,-0.17179 2.42921,-2.15955 5.39823,-4.41723 3.60635,-2.74231 5.33876,-4.30334 5.21906,-4.70276 -0.0985,-0.32883 -0.6757,-2.4812 -1.28257,-4.78304 -0.60686,-2.30183 -1.12423,-4.22232 -1.1497,-4.26774 -0.0255,-0.0454 -2.99855,-0.47601 -6.60683,-0.956856 -3.60829,-0.48085 -6.68411,-0.98178 -6.83516,-1.11317 -0.23809,-0.20711 4.33351,-35.12179 4.63868,-35.42696 0.0629,-0.06293 3.21681,0.288657 7.00863,0.781306 5.99427,0.778798 6.93834,0.819621 7.23235,0.312727 0.18597,-0.320647 1.32232,-2.171778 2.52521,-4.113628 1.20289,-1.94185 2.18708,-3.575213 2.18708,-3.629696 0,-0.05449 -1.88873,-2.574845 -4.19718,-5.600794 -2.30845,-3.025952 -4.14693,-5.641125 -4.08551,-5.811497 0.13548,-0.375848 27.30121,-21.068148 28.02255,-21.344953 0.30546,-0.117215 2.22592,2.050776 4.79431,5.412255 2.3566,3.084291 4.48178,5.598074 4.72262,5.586186 0.24084,-0.01189 2.32122,-0.519836 4.62306,-1.128773 l 4.18515,-1.107158 0.99647,-7.01087 c 0.54806,-3.855979 1.09713,-7.110707 1.22016,-7.23273 0.21479,-0.213028 35.091468,4.450948 35.370538,4.730019 0.12794,0.127934 -1.35065,11.821111 -1.71716,13.579896 -0.13601,0.652681 0.31758,1.076968 2.30827,2.159163 1.36265,0.740772 3.20725,1.841177 4.0991,2.445344 l 1.62155,1.098484 5.72367,-4.363303 c 3.14802,-2.399817 5.85972,-4.314168 6.026,-4.254113 0.37229,0.134454 21.0648,27.309372 21.33901,28.02395 0.1188,0.30959 -1.91138,2.130919 -5.11331,4.587292 -3.21673,2.467717 -5.28921,4.328099 -5.25672,4.718754 0.0434,0.521359 2.15893,8.803619 2.32389,9.097809 0.0255,0.0454 2.99855,0.47601 6.60683,0.95686 3.60829,0.48085 6.68289,0.98178 6.83244,1.11317 0.24435,0.21466 -4.33927,35.130266 -4.65297,35.443976 -0.0717,0.0717 -2.79756,-0.24193 -6.05736,-0.69704 -7.9175,-1.1054 -7.9338,-1.10453 -8.73743,0.46792 -0.36412,0.71247 -1.44491,2.51171 -2.40175,3.99829 -0.95685,1.48659 -1.73972,2.76123 -1.73972,2.83253 0,0.0713 1.88873,2.60542 4.19718,5.63137 2.30845,3.02595 4.14693,5.645 4.08551,5.82012 -0.14734,0.42012 -27.84738,21.47669 -28.25271,21.47669 -0.17218,0 -2.29827,-2.59038 -4.72464,-5.75641 l -4.41159,-5.75641 -2.19708,0.75591 c -1.20839,0.41574 -3.23922,0.96093 -4.51295,1.21152 l -2.31587,0.45562 -0.96353,7.23001 c -0.75195,5.64238 -1.09468,7.24421 -1.56077,7.29468 -0.32849,0.0356 -8.30842,-1.00685 -17.733188,-2.31647 z m 20.873118,-44.8528 c 5.94617,-10.12937 10.81123,-18.514626 10.81123,-18.633906 0,-0.11929 -9.79028,-0.21688 -21.75618,-0.21688 -13.893968,0 -21.708168,0.13984 -21.623318,0.38696 0.16713,0.48679 21.638408,37.029976 21.706788,36.944036 0.0276,-0.0348 4.9153,-8.35084 10.86148,-18.48021 z M 85.924302,91.825034 c 5.03637,-1.06753 9.52896,-4.10972 12.11223,-8.20189 3.847338,-6.09457 3.528438,-14.397574 -0.77765,-20.246978 -6.72104,-9.129882 -20.12015,-10.127293 -28.15185,-2.095584 -10.42194,10.421932 -4.91448,27.688582 9.79338,30.703582 2.41383,0.49482 4.12117,0.45614 7.02389,-0.15913 z m 4.89884,-11.86933 c -3.30888,-0.67717 -5.54792,-4.30935 -4.60224,-7.465755 1.66131,-5.544947 9.30712,-6.239018 11.7611,-1.067645 2.254418,4.75082 -1.83323,9.62331 -7.15886,8.5334 z m 37.825658,11.27265 c 8.37838,-2.88258 13.6728,-11.45747 12.25943,-19.855447 -1.32913,-7.897453 -7.46702,-13.975095 -15.47285,-15.320979 -7.85787,-1.321011 -16.16592,3.028556 -19.67331,10.299698 -1.16491,2.414964 -1.33517,3.195974 -1.47789,6.779233 -0.23148,5.811815 1.1458,9.594845 4.89916,13.456765 5.04528,5.19121 12.61799,6.99661 19.46546,4.64073 z m -17.61323,-11.2203 c -2.99234,-0.63252 -4.98694,-3.33333 -4.72062,-6.391995 0.55485,-6.372325 9.06435,-7.89011 11.85985,-2.115369 2.23961,4.626404 -1.93958,9.606484 -7.13923,8.507364 z"
       style="fill:#000000;stroke-width:0.398586" />
    <path
       id="path881"
       d="m 79.923687,96.285827 44.790173,0.0945 -22.39509,37.892103 z"
       style="fill:#ffa200;fill-opacity:1;stroke:none;stroke-width:0.264583px;stroke-linecap:butt;stroke-linejoin:miter;stroke-opacity:1" />
    <path
       sodipodi:open="true"
       d="M 100.90444,74.156418 A 18.689234,18.18955 0 0 1 82.251505,92.345934 18.689234,18.18955 0 0 1 63.52611,74.227081 18.689234,18.18955 0 0 1 82.106296,55.967176 18.689234,18.18955 0 0 1 100.90387,74.015092"
       sodipodi:arc-type="arc"
       sodipodi:end="6.2754156"
       sodipodi:start="0"
       sodipodi:ry="18.18955"
       sodipodi:rx="18.689234"
       sodipodi:cy="74.156418"
       sodipodi:cx="82.215202"
       sodipodi:type="arc"
       id="path883"
       style="fill:#ffffff;fill-opacity:1;stroke:none;stroke-width:0.310662;stroke-linecap:round;stroke-linejoin:round;stroke-opacity:1;paint-order:stroke fill markers" />
    <path
       d="M 104.1075,74.034255 A 18.689234,18.18955 0 0 0 122.76043,92.223773 18.689234,18.18955 0 0 0 141.48582,74.104919 18.689234,18.18955 0 0 0 122.90564,55.845013 18.689234,18.18955 0 0 0 104.10806,73.892929"
       style="fill:#ffffff;fill-opacity:1;stroke:none;stroke-width:0.310663;stroke-linecap:round;stroke-linejoin:round;stroke-opacity:1;paint-order:stroke fill markers"
       id="path883-6" />
    <path
       d="m 97.313282,74.581047 a 6.1528435,5.9523911 0 0 1 -6.140897,5.95238 6.1528435,5.9523911 0 0 1 -6.164744,-5.929265 6.1528435,5.9523911 0 0 1 6.116957,-5.975405 6.1528435,5.9523911 0 0 1 6.188498,5.90606"
       sodipodi:arc-type="arc"
       sodipodi:open="true"
       sodipodi:end="6.2754186"
       sodipodi:start="0"
       sodipodi:ry="5.9523911"
       sodipodi:rx="6.1528435"
       sodipodi:cy="74.581047"
       sodipodi:cx="91.160439"
       sodipodi:type="arc"
       id="path901"
       style="fill:#000000;fill-opacity:1;stroke:none;stroke-width:0.298711;stroke-linecap:round;stroke-linejoin:round;stroke-opacity:1;paint-order:stroke fill markers" />
    <path
       transform="scale(-1,1)"
       style="fill:#000000;fill-opacity:1;stroke:none;stroke-width:0.298712;stroke-linecap:round;stroke-linejoin:round;stroke-opacity:1;paint-order:stroke fill markers"
       id="path901-2"
       sodipodi:type="arc"
       sodipodi:cx="-112.38683"
       sodipodi:cy="74.033653"
       sodipodi:rx="6.1528435"
       sodipodi:ry="5.9523911"
       sodipodi:start="0"
       sodipodi:end="6.2754186"
       sodipodi:open="true"
       sodipodi:arc-type="arc"
       d="m -106.23399,74.033653 a 6.1528435,5.9523911 0 0 1 -6.1409,5.95238 6.1528435,5.9523911 0 0 1 -6.16474,-5.929265 6.1528435,5.9523911 0 0 1 6.11696,-5.975405 6.1528435,5.9523911 0 0 1 6.18849,5.90606" />
  </g>
</svg>
