[
  {"model": "vehicles.depot", "pk": 1, "fields": {"name": "depot 1"}},
  {"model": "vehicles.depot", "pk": 3, "fields": {"name": "depot 3"}},
  {"model": "vehicles.vehicle", "pk": 13,
    "fields": {"make": "Toyota", "model": "Corolla", "plate_number": "AP6060HT", "created_at": "2022-02-04T17:35:52.939Z",
      "updated_at": "2022-02-04T17:35:52.941Z", "depot": null, "year_of_production": 2022, "allowed_drivers": []}},
  {"model": "vehicles.vehicle", "pk": 14,
    "fields": {"make": "Toyota", "model": "Camry", "plate_number": "AP6061HT", "created_at": "2022-02-04T17:36:45.874Z",
      "updated_at": "2022-02-04T17:36:45.874Z", "depot": null, "year_of_production": 2022, "allowed_drivers": []}},
  {"model": "vehicles.vehicle", "pk": 15,
    "fields": {"make": "Toyota", "model": "Camry", "plate_number": "AP6062HT", "created_at": "2022-02-04T17:40:34.220Z",
      "updated_at": "2022-02-04T17:40:34.221Z", "depot": null, "year_of_production": 2022, "allowed_drivers": []}},
  {"model": "vehicles.vehicle", "pk": 16,
    "fields": {"make": "Toyota", "model": "Camry", "plate_number": "AP6066HT", "created_at": "2022-02-04T17:42:49.956Z",
      "updated_at": "2022-02-04T17:50:07.252Z", "depot": null, "year_of_production": 2012, "allowed_drivers": [3, 4]}}
]