<svg width="69" height="52" viewBox="0 0 69 52" fill="none" xmlns="http://www.w3.org/2000/svg">
<g opacity="0.7">
<path d="M36.5543 48.6891H33.3097V51.9416H36.5543V48.6891Z" fill="#9E0000"/>
<path d="M33.3291 45.4367H30.0846V48.6891H33.3291V45.4367Z" fill="#9E0000"/>
<path d="M30.0846 38.9513H26.84V42.2037H30.0846V38.9513Z" fill="#540000"/>
<path d="M26.84 38.9513H23.5954V42.2037H26.84V38.9513Z" fill="#540000"/>
<path d="M23.6149 38.9513H20.3703V42.2037H23.6149V38.9513Z" fill="#540000"/>
<path d="M30.0846 35.6989H26.84V38.9513H30.0846V35.6989Z" fill="#540000"/>
<path d="M23.6149 35.6989H20.3703V38.9513H23.6149V35.6989Z" fill="#540000"/>
<path d="M30.0846 32.4659H26.84V35.7183H30.0846V32.4659Z" fill="#540000"/>
<path d="M30.0846 29.2135H26.84V32.4659H30.0846V29.2135Z" fill="#540000"/>
<path d="M30.0846 25.9611H26.84V29.2135H30.0846V25.9611Z" fill="#540000"/>
<path d="M30.0846 22.7281H26.84V25.9805H30.0846V22.7281Z" fill="#540000"/>
<path d="M17.1257 38.9513H13.8811V42.2037H17.1257V38.9513Z" fill="#540000"/>
<path d="M13.9006 38.9513H10.656V42.2037H13.9006V38.9513Z" fill="#540000"/>
<path d="M20.3703 38.9513H17.1257V42.2037H20.3703V38.9513Z" fill="#540000"/>
<path d="M26.84 32.4659H23.5954V35.7183H26.84V32.4659Z" fill="#540000"/>
<path d="M23.6149 32.4659H20.3703V35.7183H23.6149V32.4659Z" fill="#540000"/>
<path d="M20.3703 29.2135H17.1257V32.4659H20.3703V29.2135Z" fill="#540000"/>
<path d="M17.1257 25.9611H13.8811V29.2135H17.1257V25.9611Z" fill="#540000"/>
<path d="M17.1257 22.7281H13.8811V25.9805H17.1257V22.7281Z" fill="#540000"/>
<path d="M17.1257 19.4756H13.8811V22.7281H17.1257V19.4756Z" fill="#540000"/>
<path d="M17.1257 16.2232H13.8811V19.4756H17.1257V16.2232Z" fill="#540000"/>
<path d="M13.9006 25.9611H10.656V29.2135H13.9006V25.9611Z" fill="#540000"/>
<path d="M10.656 25.9611H7.41142V29.2135H10.656V25.9611Z" fill="#540000"/>
<path d="M7.41143 25.9611H4.16685V29.2135H7.41143V25.9611Z" fill="#540000"/>
<path d="M13.9006 22.7281H10.656V25.9805H13.9006V22.7281Z" fill="#540000"/>
<path d="M13.9006 19.4756H10.656V22.7281H13.9006V19.4756Z" fill="#540000"/>
<path d="M10.656 22.7281H7.41142V25.9805H10.656V22.7281Z" fill="#540000"/>
<path d="M39.7989 45.4367H36.5543V48.6891H39.7989V45.4367Z" fill="#9E0000"/>
<path d="M43.0434 38.9513H39.7989V42.2037H43.0434V38.9513Z" fill="#540000"/>
<path d="M46.2686 38.9513H43.024V42.2037H46.2686V38.9513Z" fill="#540000"/>
<path d="M49.5131 38.9513H46.2686V42.2037H49.5131V38.9513Z" fill="#540000"/>
<path d="M43.0434 35.6989H39.7989V38.9513H43.0434V35.6989Z" fill="#540000"/>
<path d="M49.5131 35.6989H46.2686V38.9513H49.5131V35.6989Z" fill="#540000"/>
<path d="M43.0434 32.4659H39.7989V35.7183H43.0434V32.4659Z" fill="#540000"/>
<path d="M43.0434 29.2135H39.7989V32.4659H43.0434V29.2135Z" fill="#540000"/>
<path d="M43.0434 25.9611H39.7989V29.2135H43.0434V25.9611Z" fill="#540000"/>
<path d="M43.0434 22.7281H39.7989V25.9805H43.0434V22.7281Z" fill="#540000"/>
<path d="M55.9828 38.9513H52.7383V42.2037H55.9828V38.9513Z" fill="#540000"/>
<path d="M59.2274 38.9513H55.9828V42.2037H59.2274V38.9513Z" fill="#540000"/>
<path d="M52.7577 38.9513H49.5131V42.2037H52.7577V38.9513Z" fill="#540000"/>
<path d="M46.2686 32.4659H43.024V35.7183H46.2686V32.4659Z" fill="#540000"/>
<path d="M49.5131 32.4659H46.2686V35.7183H49.5131V32.4659Z" fill="#540000"/>
<path d="M52.7577 29.2135H49.5131V32.4659H52.7577V29.2135Z" fill="#540000"/>
<path d="M55.9828 25.9611H52.7383V29.2135H55.9828V25.9611Z" fill="#540000"/>
<path d="M55.9828 22.7281H52.7383V25.9805H55.9828V22.7281Z" fill="#540000"/>
<path d="M55.9828 19.4756H52.7383V22.7281H55.9828V19.4756Z" fill="#540000"/>
<path d="M55.9828 16.2232H52.7383V19.4756H55.9828V16.2232Z" fill="#540000"/>
<path d="M59.2274 25.9611H55.9828V29.2135H59.2274V25.9611Z" fill="#540000"/>
<path d="M62.472 25.9611H59.2274V29.2135H62.472V25.9611Z" fill="#540000"/>
<path d="M65.6971 25.9611H62.4525V29.2135H65.6971V25.9611Z" fill="#540000"/>
<path d="M59.2274 22.7281H55.9828V25.9805H59.2274V22.7281Z" fill="#540000"/>
<path d="M59.2274 19.4756H55.9828V22.7281H59.2274V19.4756Z" fill="#540000"/>
<path d="M62.472 22.7281H59.2274V25.9805H62.472V22.7281Z" fill="#540000"/>
<path d="M4.18628 19.4756H0.941711V22.7281H4.18628V19.4756Z" fill="#9E0000"/>
<path d="M10.656 12.9902H7.41142V16.2427H10.656V12.9902Z" fill="#9E0000"/>
<path d="M62.472 12.9902H59.2274V16.2427H62.472V12.9902Z" fill="#9E0000"/>
<path d="M68.9417 19.4756H65.6971V22.7281H68.9417V19.4756Z" fill="#9E0000"/>
<path d="M68.9417 12.9902H65.6971V16.2427H68.9417V12.9902Z" fill="#9E0000"/>
<path d="M4.18628 12.9902H0.941711V16.2427H4.18628V12.9902Z" fill="#9E0000"/>
<path d="M36.5543 29.2135H33.3097V32.4659H36.5543V29.2135Z" fill="#540000"/>
<path d="M36.5543 25.9611H33.3097V29.2135H36.5543V25.9611Z" fill="#540000"/>
<path d="M36.5543 22.7281H33.3097V25.9805H36.5543V22.7281Z" fill="#540000"/>
<path d="M36.5543 38.9513H33.3097V42.2037H36.5543V38.9513Z" fill="#540000"/>
<path d="M36.5543 35.6989H33.3097V38.9513H36.5543V35.6989Z" fill="#540000"/>
<path d="M36.5543 32.4659H33.3097V35.7183H36.5543V32.4659Z" fill="#540000"/>
<path d="M36.5543 16.2232H33.3097V19.4756H36.5543V16.2232Z" fill="#9E0000"/>
<path d="M36.5543 19.4756H33.3097V22.7281H36.5543V19.4756Z" fill="#9E0000"/>
<path d="M36.5543 9.73785H33.3097V12.9903H36.5543V9.73785Z" fill="#540000"/>
<path d="M36.5543 3.25244H33.3097V6.50488H36.5543V3.25244Z" fill="#9E0000"/>
<path d="M39.7989 3.25244H36.5543V6.50488H39.7989V3.25244Z" fill="#9E0000"/>
<path d="M43.0434 6.48541H39.7989V9.73785H43.0434V6.48541Z" fill="#9E0000"/>
<path d="M43.0434 12.9902H39.7989V16.2427H43.0434V12.9902Z" fill="#9E0000"/>
<path d="M46.2686 9.73785H43.024V12.9903H46.2686V9.73785Z" fill="#9E0000"/>
<path d="M36.5543 0H33.3097V3.25243H36.5543V0Z" fill="#9E0000"/>
<path d="M33.3291 3.25244H30.0846V6.50488H33.3291V3.25244Z" fill="#9E0000"/>
<path d="M30.0846 6.48541H26.84V9.73785H30.0846V6.48541Z" fill="#9E0000"/>
<path d="M26.84 9.73785H23.5954V12.9903H26.84V9.73785Z" fill="#9E0000"/>
<path d="M30.0846 12.9902H26.84V16.2427H30.0846V12.9902Z" fill="#9E0000"/>
<path d="M33.3291 16.2232H30.0846V19.4756H33.3291V16.2232Z" fill="#9E0000"/>
<path d="M39.7989 16.2232H36.5543V19.4756H39.7989V16.2232Z" fill="#9E0000"/>
<path d="M39.7989 6.48541H36.5543V9.73785H39.7989V6.48541Z" fill="#9E0000"/>
<path d="M43.0434 9.73785H39.7989V12.9903H43.0434V9.73785Z" fill="#9E0000"/>
<path d="M39.7989 12.9902H36.5543V16.2427H39.7989V12.9902Z" fill="#9E0000"/>
<path d="M33.3291 6.48541H30.0846V9.73785H33.3291V6.48541Z" fill="#9E0000"/>
<path d="M30.0846 9.73785H26.84V12.9903H30.0846V9.73785Z" fill="#9E0000"/>
<path d="M33.3291 12.9902H30.0846V16.2427H33.3291V12.9902Z" fill="#9E0000"/>
</g>
</svg>
