STVARANJE NOVE APP:
1. python manage.py startapp ime_app
2. translateapp/settings u INSTALLED_APPS dodame ime_app.apps.(ime iz apps.py)
3. pravimo folder templates pa u njega folder s imenom app i unutar njega novi html
4. pravimo urls.py za novi app: from django urls import path,include
                                app_name="app_name"
                                urlpatterns=[ 
                                    path('',views.app_name,name ="app_name") ]
5. u translateapp/urls.py dodamo path
6.kreiramo views.py za novi app: def app_name(request) :
                                     context={}
                                     return render(request,'app_name(folder)/novi.html',context)
7.dodamo u navigaciju 


https://legionscript.medium.com/