{
  "buildingName": "PROSUMER 1 (Solar)",
  "type": "prosumer",
  "walletAddress": "0x2ce42acb894725fc7f18c7988a6fcc9794d9dac8",
  "walletPassword": "hslu",
  "oracleAddress": "0x2ef995db69edf6791b1ab279083d90ef0a063194",
  "oraclePassword": "hslu"
}