$MeshFormat
2.2 0 8
$EndMeshFormat
$PhysicalNames
7
1 1 "BOTTOM"
1 2 "RIGHT"
1 3 "TOP"
1 4 "MID_BOTTOM"
1 5 "MID_TOP"
1 6 "RIGHT_CIRCLE"
2 7 "INTERIEUR"
$EndPhysicalNames
$Nodes
429
1 0.1 0 0
2 0.05 0 0
3 0.05 0.1 0
4 0.1 0.1 0
5 0.05 0.07500000000000001 0
6 0.05 0.025 0
7 0.0676776695296637 0.03232233047033631 0
8 0.0676776695296637 0.0676776695296637 0
9 0.09444444444445679 0 0
10 0.08888888888892023 0 0
11 0.08333333333338035 0 0
12 0.07777777777784046 0 0
13 0.07222222222228129 0 0
14 0.06666666666671278 0 0
15 0.061111111111142 0 0
16 0.05555555555557137 0 0
17 0.05 0.00208333333332958 0
18 0.05 0.004166666666658402 0
19 0.05 0.006249999999985417 0
20 0.05 0.00833333333331277 0
21 0.05 0.01041666666663945 0
22 0.05 0.01249999999996714 0
23 0.05 0.01458333333330566 0
24 0.05 0.01666666666664431 0
25 0.05 0.0187499999999834 0
26 0.05 0.02083333333332249 0
27 0.05 0.02291666666666136 0
28 0.0555555555555405 0.1 0
29 0.06111111111108099 0.1 0
30 0.06666666666662147 0.1 0
31 0.07222222222216193 0.1 0
32 0.07777777777771357 0.1 0
33 0.0833333333332863 0.1 0
34 0.08888888888885814 0.1 0
35 0.09444444444442907 0.1 0
36 0.1 0.09285714285716262 0
37 0.1 0.08571428571432524 0
38 0.1 0.07857142857148786 0
39 0.1 0.07142857142865049 0
40 0.1 0.0642857142858131 0
41 0.1 0.05714285714297571 0
42 0.1 0.05000000000013698 0
43 0.1 0.04285714285726103 0
44 0.1 0.03571428571438336 0
45 0.1 0.02857142857150723 0
46 0.1 0.0214285714286311 0
47 0.1 0.01428571428575495 0
48 0.1 0.007142857142878448 0
49 0.05 0.07708333333332792 0
50 0.05 0.07916666666665312 0
51 0.05 0.08124999999997833 0
52 0.05 0.08333333333330352 0
53 0.05 0.08541666666664047 0
54 0.05 0.0874999999999783 0
55 0.05 0.08958333333331617 0
56 0.05 0.0916666666666531 0
57 0.05 0.09374999999998915 0
58 0.05 0.09583333333332519 0
59 0.05 0.09791666666666124 0
60 0.05217889356869446 0.02509513254770663 0
61 0.05434120444167867 0.02537980617469575 0
62 0.05647047612756465 0.02585185434277373 0
63 0.05855050358314381 0.02650768448035305 0
64 0.06056545654352456 0.02734230532408705 0
65 0.06250000000000767 0.02834936490539346 0
66 0.06433941090878224 0.02952119889277947 0
67 0.06606969024216433 0.03084888892202626 0
68 0.06954578706169867 0.03441275495352905 0
69 0.07116810498070178 0.0366991980871081 0
70 0.07252422169755404 0.03915290652204766 0
71 0.07359708325770103 0.04174302345109747 0
72 0.07437319780453877 0.04443697665106222 0
73 0.0748428052473272 0.04720088809738294 0
74 0.07500000000000001 0.04999999999996082 0
75 0.07484280524733516 0.05279911190254638 0
76 0.07437319780455215 0.05556302334887916 0
77 0.07359708325771661 0.05825697654885802 0
78 0.07252422169756609 0.06084709347792734 0
79 0.07116810498071117 0.06330080191287697 0
80 0.06954578706170117 0.06558724504646783 0
81 0.06606969024215947 0.06915111107797783 0
82 0.06433941090877963 0.07047880110722238 0
83 0.0625000000000062 0.0716506350946074 0
84 0.06056545654352515 0.0726576946759127 0
85 0.05855050358314798 0.07349231551964545 0
86 0.05647047612757241 0.0741481456572242 0
87 0.05434120444169008 0.07462019382530224 0
88 0.05217889356869489 0.07490486745229336 0
89 0.07037119706885364 0.02962880293114636 0
90 0.07306472460804325 0.02693527539195675 0
91 0.07575825214722778 0.02424174785277222 0
92 0.07845177968641502 0.02154822031358498 0
93 0.08114530722560057 0.01885469277439944 0
94 0.08383883476479018 0.01616116523520984 0
95 0.0865323623039939 0.0134676376960061 0
96 0.08922588984319141 0.01077411015680859 0
97 0.0919194173824 0.008080582617600009 0
98 0.09461294492159186 0.005387055078408136 0
99 0.09730647246079571 0.002693527539204293 0
100 0.07037119706885388 0.07037119706885388 0
101 0.07306472460804404 0.07306472460804404 0
102 0.07575825214722609 0.07575825214722609 0
103 0.07845177968641355 0.07845177968641355 0
104 0.0811453072255983 0.0811453072255983 0
105 0.08383883476478847 0.08383883476478847 0
106 0.08653236230399491 0.08653236230399491 0
107 0.0892258898431896 0.0892258898431896 0
108 0.09191941738240508 0.09191941738240508 0
109 0.09461294492158713 0.09461294492158713 0
110 0.09730647246079448 0.09730647246079448 0
111 0.05527416705666385 0.002091261045640057 0
112 0.06054695222201785 0.002114983847890715 0
113 0.0658169841217805 0.002154321195232081 0
114 0.07108291233568215 0.002208973706698532 0
115 0.07634341767497538 0.002278525443677846 0
116 0.08159722222225943 0.002362447075454835 0
117 0.08684309905723449 0.002460099907738432 0
118 0.09207988159425716 0.002570740743510404 0
119 0.05499277855775639 0.00418252209127941 0
120 0.0599827933328938 0.004229967695780776 0
121 0.06496730157684834 0.004308642390463554 0
122 0.06994360244908315 0.004417947413396494 0
123 0.0749090575721105 0.004557050887355156 0
124 0.07986111111113882 0.004724894150909163 0
125 0.08479730922554912 0.004920199815476381 0
126 0.08971531874405793 0.005141481487020344 0
127 0.05471139005885026 0.006273783136915882 0
128 0.05941863444377238 0.006344951543666863 0
129 0.06411761903192009 0.006462963585689946 0
130 0.06880429256248946 0.00662692112008826 0
131 0.07347469746925223 0.006835576331025138 0
132 0.07812500000002615 0.007087341226355017 0
133 0.082751519393873 0.007380299723204704 0
134 0.08735075589386931 0.00771222223051949 0
135 0.05443000155994225 0.008365044182554501 0
136 0.05885447555464726 0.008459935391556907 0
137 0.06326793648698635 0.008617284780922116 0
138 0.0676649826758883 0.008835894826787616 0
139 0.07204033736638465 0.009114101774704531 0
140 0.0763888888889023 0.009449788301812107 0
141 0.08070572956218389 0.00984039963094608 0
142 0.08498619304366584 0.01028296297403352 0
143 0.05414861306103546 0.01045630522819131 0
144 0.05829031666552457 0.010574919239444 0
145 0.06241825394205621 0.01077160597615019 0
146 0.06652567278929207 0.01104486853348173 0
147 0.07060597726352322 0.01139262721837752 0
148 0.07465277777778584 0.01181223537726163 0
149 0.07865993973050336 0.01230049953867873 0
150 0.08262163019347218 0.01285370371753765 0
151 0.053867224562128 0.01254756627382968 0
152 0.05772615777640053 0.01268990308733322 0
153 0.06156857139712406 0.01292592717138094 0
154 0.06538636290269312 0.01325384224017909 0
155 0.06917161716065837 0.01367115266205434 0
156 0.07291666666666528 0.01417468245271558 0
157 0.07661414989881804 0.01476059944641639 0
158 0.08025706734327306 0.0154244444610474 0
159 0.05358583606322221 0.0146388273194758 0
160 0.0571619988872798 0.01480488693522718 0
161 0.06071888885219687 0.01508024836661351 0
162 0.06424705301610074 0.01546281594687544 0
163 0.0677372570578017 0.01594967810572738 0
164 0.07118055555555444 0.01653712952816305 0
165 0.07456836006714394 0.01722069935414498 0
166 0.0778925044930866 0.0179951852045455 0
167 0.05330444756431686 0.01673008836512157 0
168 0.05659783999815998 0.01691987078312032 0
169 0.05986920630727104 0.01723456956184482 0
170 0.06310774312951015 0.01767178965357004 0
171 0.06630289695494727 0.01822820354939822 0
172 0.06944444444444631 0.01889957660360785 0
173 0.07252257023547302 0.01968079926187041 0
174 0.07552794164290379 0.02056592594804 0
175 0.05302305906541133 0.01882134941076791 0
176 0.05603368110903979 0.01903485463101418 0
177 0.05901952376234464 0.01938889075707695 0
178 0.06196843324291884 0.01988076336026562 0
179 0.06486853685209193 0.02050672899307016 0
180 0.06770833333333703 0.0212620236790539 0
181 0.07047678040380079 0.02214089916959724 0
182 0.07316337879271942 0.02313666669153606 0
183 0.05274167056650609 0.02091261045641396 0
184 0.05546952221992021 0.02114983847890741 0
185 0.05816984121741914 0.02154321195230818 0
186 0.06082912335632872 0.02208973706695998 0
187 0.06343417674923812 0.0227852544367406 0
188 0.06597222222222959 0.02362447075449815 0
189 0.06843099057213065 0.02460099907732197 0
190 0.07079881594253754 0.0257074074350297 0
191 0.0524602820676003 0.02300387150206037 0
192 0.05490536333079948 0.02326482232680163 0
193 0.05732015867249196 0.02369753314754097 0
194 0.05968981346973634 0.02429871077365651 0
195 0.06199981664638143 0.02506377988041377 0
196 0.06423611111111872 0.02598691782994572 0
197 0.06638520074045659 0.02706109898505062 0
198 0.06843425309235109 0.02827814817852784 0
199 0.09746214892179821 0.09058465137292879 0
200 0.0949242978435948 0.08831215988869329 0
201 0.09238644676541499 0.08603966840448021 0
202 0.08984859568720394 0.0837671769202375 0
203 0.08731074460901232 0.0814946854360132 0
204 0.08477289353080975 0.07922219395177849 0
205 0.08223504245262245 0.0769497024675577 0
206 0.0796971913744402 0.07467721098334157 0
207 0.07715934029625547 0.07240471949912307 0
208 0.07462148921807579 0.0701322280149094 0
209 0.0720836381398885 0.06785973653068861 0
210 0.09759734208171635 0.08384649539753017 0
211 0.09519468416343109 0.08197870508073347 0
212 0.09279202624516796 0.0801109147639565 0
213 0.09038936832687555 0.07824312444715359 0
214 0.08798671040860141 0.07637533413036668 0
215 0.08558405249031695 0.07450754381357075 0
216 0.08318139457204693 0.07263975349678645 0
217 0.08077873665378171 0.0707719631800061 0
218 0.07837607873551408 0.06890417286322373 0
219 0.07597342081725122 0.06703638254644556 0
220 0.07357076289898121 0.06516859222966123 0
221 0.09771035180812139 0.07709440064701824 0
222 0.09542070361624136 0.07561737272254707 0
223 0.09313105542438201 0.07414034479809299 0
224 0.09084140723249526 0.07266331687361656 0
225 0.08855175904062559 0.07118628894915389 0
226 0.0862621108487463 0.0697092610246834 0
227 0.08397246265688066 0.06823223310022236 0
228 0.08168281446501954 0.06675520517576464 0
229 0.07939316627315626 0.06527817725130516 0
230 0.07710351808129734 0.06380114932684934 0
231 0.07481386988943173 0.06232412140238831 0
232 0.09779975693813432 0.07033093852199629 0
233 0.09559951387626743 0.06923330561534073 0
234 0.09339927081441973 0.06813567270869952 0
235 0.09119902775254657 0.06703803980203955 0
236 0.08899878469068932 0.06594040689539106 0
237 0.08679854162882303 0.06484277398873606 0
238 0.08459829856696985 0.06374514108208837 0
239 0.08239805550512096 0.06264750817544326 0
240 0.08019781244326993 0.06154987526879679 0
241 0.07799756938142305 0.06045224236215332 0
242 0.07579732631956984 0.05935460945550561 0
243 0.09786443315037092 0.06355882337439857 0
244 0.09572886630074079 0.06283193246298267 0
245 0.09359329945112869 0.06210504155157859 0
246 0.09145773260149255 0.06137815064015924 0
247 0.08932216575187152 0.06065125972874914 0
248 0.08718659890224192 0.0599243688173338 0
249 0.08505103205262496 0.05919747790592364 0
250 0.08291546520301206 0.05847058699451545 0
251 0.08077989835339716 0.05774369608310616 0
252 0.07864433150378619 0.05701680517169935 0
253 0.07650876465416917 0.0562899142602892 0
254 0.09790356710393641 0.05678087837293794 0
255 0.0958071342078719 0.05641889960289892 0
256 0.09371070131182427 0.05605692083286914 0
257 0.09161426841575415 0.05569494206282757 0
258 0.08951783551969818 0.05533296329279304 0
259 0.08742140262363418 0.05497098452275448 0
260 0.08532496972758238 0.05460900575271906 0
261 0.08322853683153457 0.05424702698268495 0
262 0.08113210393548484 0.05388504821265006 0
263 0.07903567103943876 0.05352306944261707 0
264 0.07693923814338699 0.05316109067258165 0
265 0.09791666666665864 0.05000000000012167 0
266 0.09583333333331646 0.05000000000010524 0
267 0.09374999999999023 0.05000000000009548 0
268 0.09166666666664272 0.05000000000007736 0
269 0.0895833333333086 0.0500000000000641 0
270 0.08749999999996691 0.05000000000004805 0
271 0.08541666666663725 0.05000000000003309 0
272 0.08333333333331136 0.05000000000001881 0
273 0.0812499999999837 0.05000000000000401 0
274 0.07916666666665947 0.04999999999999058 0
275 0.07708333333332978 0.04999999999997561 0
276 0.09790356710393593 0.04321912162727194 0
277 0.09580713420787124 0.04358110039728185 0
278 0.09371070131182159 0.04394307916729583 0
279 0.09161426841575174 0.04430505793730489 0
280 0.08951783551969468 0.04466703670731665 0
281 0.08742140262363043 0.04502901547732686 0
282 0.08532496972757808 0.04539099424733609 0
283 0.08322853683152949 0.04575297301734536 0
284 0.08113210393547912 0.04611495178735442 0
285 0.07903567103943201 0.04647693055736429 0
286 0.07693923814337966 0.04683890932737353 0
287 0.09786443315037018 0.03644117662577542 0
288 0.0957288663007399 0.03716806753716654 0
289 0.09359329945112389 0.0378949584485592 0
290 0.09145773260148865 0.03862184935995039 0
291 0.08932216575186565 0.03934874027134205 0
292 0.08718659890223573 0.04007563118273343 0
293 0.0850510320526178 0.04080252209412175 0
294 0.08291546520300359 0.04152941300550948 0
295 0.08077989835338761 0.0422563039168973 0
296 0.07864433150377481 0.04298319482828534 0
297 0.07650876465415685 0.04371008573967368 0
298 0.09779975693813354 0.02966906147814331 0
299 0.09559951387626683 0.03076669438477855 0
300 0.09339927081441368 0.03186432729141273 0
301 0.09119902775254216 0.03296196019804894 0
302 0.08899878469068238 0.03405959310468341 0
303 0.08679854162881598 0.03515722601131886 0
304 0.08459829856696174 0.03625485891794914 0
305 0.08239805550511119 0.03735249182457816 0
306 0.08019781244325899 0.03845012473120757 0
307 0.07799756938140973 0.03954775763783665 0
308 0.07579732631955546 0.04064539054446695 0
309 0.09771035180812106 0.02290559935308748 0
310 0.09542070361624203 0.02438262727754313 0
311 0.09313105542437608 0.02585965520199505 0
312 0.09084140723249226 0.02733668312645259 0
313 0.08855175904061999 0.02881371105090611 0
314 0.08626211084874125 0.03029073897536187 0
315 0.08397246265687494 0.03176776689981034 0
316 0.08168281446501237 0.03324479482425689 0
317 0.07939316627314819 0.03472182274870412 0
318 0.07710351808128685 0.03619885067315046 0
319 0.07481386988942057 0.03767587859759894 0
320 0.09759734208171644 0.01615350460254086 0
321 0.09519468416343291 0.01802129491932614 0
322 0.09279202624516195 0.01988908523610501 0
323 0.09038936832687375 0.02175687555289309 0
324 0.08798671040859679 0.02362466586967488 0
325 0.08558405249031351 0.02549245618646018 0
326 0.08318139457204309 0.02736024650323601 0
327 0.08077873665377651 0.02922803682000921 0
328 0.07837607873550828 0.03109582713678343 0
329 0.07597342081724284 0.03296361745355617 0
330 0.07357076289897241 0.03483140777033199 0
331 0.09746214892179909 0.009415348627107342 0
332 0.09492429784359843 0.0116878401113357 0
333 0.09238644676541004 0.0139603315955549 0
334 0.08984859568720466 0.01623282307978701 0
335 0.08731074460901045 0.01850531456401048 0
336 0.08477289353080997 0.02077780604823879 0
337 0.08223504245262292 0.02305029753245534 0
338 0.07969719137443983 0.02532278901666856 0
339 0.07715934029625504 0.02759528050088315 0
340 0.07462148921807303 0.02986777198509563 0
341 0.072083638139886 0.03214026346931217 0
342 0.06843425309234467 0.07172185182147522 0
343 0.0707988159425299 0.07429259256497235 0
344 0.07316337879270791 0.07686333330846226 0
345 0.07552794164289074 0.07943407405195699 0
346 0.07789250449307097 0.08200481479545033 0
347 0.08025706734325602 0.08457555553894852 0
348 0.08262163019345553 0.08714629628246118 0
349 0.08498619304364459 0.08971703702596336 0
350 0.08735075589385217 0.09228777776948389 0
351 0.08971531874403005 0.09485851851297475 0
352 0.09207988159423039 0.09742925925648807 0
353 0.06638520074044947 0.07293890101494938 0
354 0.06843099057211936 0.07539900092267589 0
355 0.07047678040378291 0.0778591008303961 0
356 0.0725225702354507 0.08031920073812052 0
357 0.07456836006711606 0.08277930064584491 0
358 0.07661414989878566 0.08523940055357364 0
359 0.07865993973046792 0.08769950046131506 0
360 0.080705729562141 0.09015960036904713 0
361 0.08275151939383035 0.09261970027679528 0
362 0.08479730922549367 0.09507980018451738 0
363 0.08684309905717663 0.09753990009225914 0
364 0.06423611111111004 0.07401308217005229 0
365 0.06597222222221391 0.07637552924549644 0
366 0.06770833333331239 0.07873797632093517 0
367 0.06944444444441449 0.08110042339637752 0
368 0.07118055555551442 0.08346287047182127 0
369 0.07291666666661793 0.08582531754726888 0
370 0.07465277777773233 0.08818776462272732 0
371 0.07638888888883889 0.09055021169817766 0
372 0.07812499999995935 0.09291265877364166 0
373 0.07986111111105754 0.09527510584908336 0
374 0.08159722222217254 0.09763755292454192 0
375 0.06199981664637184 0.07493622011958208 0
376 0.0634341767492186 0.07721474556325046 0
377 0.06486853685206087 0.07949327100691431 0
378 0.06630289695490611 0.08177179645058118 0
379 0.06773725705774952 0.084050321894251 0
380 0.06917161716059587 0.08632884733792411 0
381 0.07060597726345136 0.0886073727816063 0
382 0.07204033736630024 0.09088589822528156 0
383 0.07347469746916074 0.09316442366896807 0
384 0.07490905757200267 0.09544294911263601 0
385 0.07634341767485867 0.09772147455631801 0
386 0.05968981346973062 0.07570128922633702 0
387 0.06082912335631332 0.07791026293302727 0
388 0.0619684332428924 0.08011923663971389 0
389 0.06310774312947394 0.08232821034640293 0
390 0.06424705301605391 0.08453718405309653 0
391 0.0653863629026363 0.08674615775979291 0
392 0.06652567278922586 0.08895513146649653 0
393 0.06766498267581025 0.09116410517319452 0
394 0.06880429256240392 0.09337307887990129 0
395 0.06994360244898273 0.09558205258659316 0
396 0.07108291233557276 0.09779102629329631 0
397 0.05732015867249179 0.07630246685245075 0
398 0.05816984121741122 0.07845678804767564 0
399 0.05901952376232794 0.08061110924289783 0
400 0.05986920630724649 0.08276543043812183 0
401 0.06071888885216383 0.08491975163335204 0
402 0.06156857139708299 0.08707407282858456 0
403 0.06241825394200753 0.08922839402382254 0
404 0.06326793648692822 0.09138271521905601 0
405 0.06411761903185581 0.09353703641429588 0
406 0.06496730157677232 0.09569135760952464 0
407 0.06581698412169722 0.09784567880476182 0
408 0.05490536333080508 0.0767351776731888 0
409 0.05546952221992012 0.07885016152107334 0
410 0.05603368110903335 0.08096514536895608 0
411 0.05659783999814778 0.08308012921684003 0
412 0.05716199888726142 0.08519511306473196 0
413 0.05772615777637626 0.08731009691262569 0
414 0.0582903166654947 0.08942508076052307 0
415 0.05885447555461056 0.0915400646084172 0
416 0.05941863444373102 0.09365504845631525 0
417 0.05998279333284408 0.09577003230420589 0
418 0.06054695222196275 0.09788501615210217 0
419 0.05246028206759822 0.07699612849793042 0
420 0.05274167056650159 0.07908738954356512 0
421 0.05302305906540405 0.08117865058919894 0
422 0.05330444756430714 0.08326991163483337 0
423 0.0535858360632098 0.0853611726804776 0
424 0.05386722456211305 0.0874524337261232 0
425 0.05414861306101813 0.0895436947717706 0
426 0.05443000155992189 0.09163495581741592 0
427 0.05471139005882797 0.09372621686306279 0
428 0.05499277855773035 0.09581747790870593 0
429 0.05527416705663553 0.09790873895435188 0
$EndNodes
$Elements
472
1 1 2 1 1 1 9
2 1 2 1 1 9 10
3 1 2 1 1 10 11
4 1 2 1 1 11 12
5 1 2 1 1 12 13
6 1 2 1 1 13 14
7 1 2 1 1 14 15
8 1 2 1 1 15 16
9 1 2 1 1 16 2
10 1 2 4 2 2 17
11 1 2 4 2 17 18
12 1 2 4 2 18 19
13 1 2 4 2 19 20
14 1 2 4 2 20 21
15 1 2 4 2 21 22
16 1 2 4 2 22 23
17 1 2 4 2 23 24
18 1 2 4 2 24 25
19 1 2 4 2 25 26
20 1 2 4 2 26 27
21 1 2 4 2 27 6
22 1 2 3 3 3 28
23 1 2 3 3 28 29
24 1 2 3 3 29 30
25 1 2 3 3 30 31
26 1 2 3 3 31 32
27 1 2 3 3 32 33
28 1 2 3 3 33 34
29 1 2 3 3 34 35
30 1 2 3 3 35 4
31 1 2 2 4 4 36
32 1 2 2 4 36 37
33 1 2 2 4 37 38
34 1 2 2 4 38 39
35 1 2 2 4 39 40
36 1 2 2 4 40 41
37 1 2 2 4 41 42
38 1 2 2 4 42 43
39 1 2 2 4 43 44
40 1 2 2 4 44 45
41 1 2 2 4 45 46
42 1 2 2 4 46 47
43 1 2 2 4 47 48
44 1 2 2 4 48 1
45 1 2 5 5 5 49
46 1 2 5 5 49 50
47 1 2 5 5 50 51
48 1 2 5 5 51 52
49 1 2 5 5 52 53
50 1 2 5 5 53 54
51 1 2 5 5 54 55
52 1 2 5 5 55 56
53 1 2 5 5 56 57
54 1 2 5 5 57 58
55 1 2 5 5 58 59
56 1 2 5 5 59 3
57 1 2 6 6 6 60
58 1 2 6 6 60 61
59 1 2 6 6 61 62
60 1 2 6 6 62 63
61 1 2 6 6 63 64
62 1 2 6 6 64 65
63 1 2 6 6 65 66
64 1 2 6 6 66 67
65 1 2 6 6 67 7
66 1 2 6 7 7 68
67 1 2 6 7 68 69
68 1 2 6 7 69 70
69 1 2 6 7 70 71
70 1 2 6 7 71 72
71 1 2 6 7 72 73
72 1 2 6 7 73 74
73 1 2 6 7 74 75
74 1 2 6 7 75 76
75 1 2 6 7 76 77
76 1 2 6 7 77 78
77 1 2 6 7 78 79
78 1 2 6 7 79 80
79 1 2 6 7 80 8
80 1 2 6 8 8 81
81 1 2 6 8 81 82
82 1 2 6 8 82 83
83 1 2 6 8 83 84
84 1 2 6 8 84 85
85 1 2 6 8 85 86
86 1 2 6 8 86 87
87 1 2 6 8 87 88
88 1 2 6 8 88 5
89 3 2 7 12 2 17 111 16
90 3 2 7 12 16 111 112 15
91 3 2 7 12 15 112 113 14
92 3 2 7 12 14 113 114 13
93 3 2 7 12 13 114 115 12
94 3 2 7 12 12 115 116 11
95 3 2 7 12 11 116 117 10
96 3 2 7 12 10 117 118 9
97 3 2 7 12 9 118 99 1
98 3 2 7 12 17 18 119 111
99 3 2 7 12 111 119 120 112
100 3 2 7 12 112 120 121 113
101 3 2 7 12 113 121 122 114
102 3 2 7 12 114 122 123 115
103 3 2 7 12 115 123 124 116
104 3 2 7 12 116 124 125 117
105 3 2 7 12 117 125 126 118
106 3 2 7 12 118 126 98 99
107 3 2 7 12 18 19 127 119
108 3 2 7 12 119 127 128 120
109 3 2 7 12 120 128 129 121
110 3 2 7 12 121 129 130 122
111 3 2 7 12 122 130 131 123
112 3 2 7 12 123 131 132 124
113 3 2 7 12 124 132 133 125
114 3 2 7 12 125 133 134 126
115 3 2 7 12 126 134 97 98
116 3 2 7 12 19 20 135 127
117 3 2 7 12 127 135 136 128
118 3 2 7 12 128 136 137 129
119 3 2 7 12 129 137 138 130
120 3 2 7 12 130 138 139 131
121 3 2 7 12 131 139 140 132
122 3 2 7 12 132 140 141 133
123 3 2 7 12 133 141 142 134
124 3 2 7 12 134 142 96 97
125 3 2 7 12 20 21 143 135
126 3 2 7 12 135 143 144 136
127 3 2 7 12 136 144 145 137
128 3 2 7 12 137 145 146 138
129 3 2 7 12 138 146 147 139
130 3 2 7 12 139 147 148 140
131 3 2 7 12 140 148 149 141
132 3 2 7 12 141 149 150 142
133 3 2 7 12 142 150 95 96
134 3 2 7 12 21 22 151 143
135 3 2 7 12 143 151 152 144
136 3 2 7 12 144 152 153 145
137 3 2 7 12 145 153 154 146
138 3 2 7 12 146 154 155 147
139 3 2 7 12 147 155 156 148
140 3 2 7 12 148 156 157 149
141 3 2 7 12 149 157 158 150
142 3 2 7 12 150 158 94 95
143 3 2 7 12 22 23 159 151
144 3 2 7 12 151 159 160 152
145 3 2 7 12 152 160 161 153
146 3 2 7 12 153 161 162 154
147 3 2 7 12 154 162 163 155
148 3 2 7 12 155 163 164 156
149 3 2 7 12 156 164 165 157
150 3 2 7 12 157 165 166 158
151 3 2 7 12 158 166 93 94
152 3 2 7 12 23 24 167 159
153 3 2 7 12 159 167 168 160
154 3 2 7 12 160 168 169 161
155 3 2 7 12 161 169 170 162
156 3 2 7 12 162 170 171 163
157 3 2 7 12 163 171 172 164
158 3 2 7 12 164 172 173 165
159 3 2 7 12 165 173 174 166
160 3 2 7 12 166 174 92 93
161 3 2 7 12 24 25 175 167
162 3 2 7 12 167 175 176 168
163 3 2 7 12 168 176 177 169
164 3 2 7 12 169 177 178 170
165 3 2 7 12 170 178 179 171
166 3 2 7 12 171 179 180 172
167 3 2 7 12 172 180 181 173
168 3 2 7 12 173 181 182 174
169 3 2 7 12 174 182 91 92
170 3 2 7 12 25 26 183 175
171 3 2 7 12 175 183 184 176
172 3 2 7 12 176 184 185 177
173 3 2 7 12 177 185 186 178
174 3 2 7 12 178 186 187 179
175 3 2 7 12 179 187 188 180
176 3 2 7 12 180 188 189 181
177 3 2 7 12 181 189 190 182
178 3 2 7 12 182 190 90 91
179 3 2 7 12 26 27 191 183
180 3 2 7 12 183 191 192 184
181 3 2 7 12 184 192 193 185
182 3 2 7 12 185 193 194 186
183 3 2 7 12 186 194 195 187
184 3 2 7 12 187 195 196 188
185 3 2 7 12 188 196 197 189
186 3 2 7 12 189 197 198 190
187 3 2 7 12 190 198 89 90
188 3 2 7 12 27 6 60 191
189 3 2 7 12 191 60 61 192
190 3 2 7 12 192 61 62 193
191 3 2 7 12 193 62 63 194
192 3 2 7 12 194 63 64 195
193 3 2 7 12 195 64 65 196
194 3 2 7 12 196 65 66 197
195 3 2 7 12 197 66 67 198
196 3 2 7 12 198 67 7 89
197 3 2 7 14 4 36 199 110
198 3 2 7 14 110 199 200 109
199 3 2 7 14 109 200 201 108
200 3 2 7 14 108 201 202 107
201 3 2 7 14 107 202 203 106
202 3 2 7 14 106 203 204 105
203 3 2 7 14 105 204 205 104
204 3 2 7 14 104 205 206 103
205 3 2 7 14 103 206 207 102
206 3 2 7 14 102 207 208 101
207 3 2 7 14 101 208 209 100
208 3 2 7 14 100 209 80 8
209 3 2 7 14 36 37 210 199
210 3 2 7 14 199 210 211 200
211 3 2 7 14 200 211 212 201
212 3 2 7 14 201 212 213 202
213 3 2 7 14 202 213 214 203
214 3 2 7 14 203 214 215 204
215 3 2 7 14 204 215 216 205
216 3 2 7 14 205 216 217 206
217 3 2 7 14 206 217 218 207
218 3 2 7 14 207 218 219 208
219 3 2 7 14 208 219 220 209
220 3 2 7 14 209 220 79 80
221 3 2 7 14 37 38 221 210
222 3 2 7 14 210 221 222 211
223 3 2 7 14 211 222 223 212
224 3 2 7 14 212 223 224 213
225 3 2 7 14 213 224 225 214
226 3 2 7 14 214 225 226 215
227 3 2 7 14 215 226 227 216
228 3 2 7 14 216 227 228 217
229 3 2 7 14 217 228 229 218
230 3 2 7 14 218 229 230 219
231 3 2 7 14 219 230 231 220
232 3 2 7 14 220 231 78 79
233 3 2 7 14 38 39 232 221
234 3 2 7 14 221 232 233 222
235 3 2 7 14 222 233 234 223
236 3 2 7 14 223 234 235 224
237 3 2 7 14 224 235 236 225
238 3 2 7 14 225 236 237 226
239 3 2 7 14 226 237 238 227
240 3 2 7 14 227 238 239 228
241 3 2 7 14 228 239 240 229
242 3 2 7 14 229 240 241 230
243 3 2 7 14 230 241 242 231
244 3 2 7 14 231 242 77 78
245 3 2 7 14 39 40 243 232
246 3 2 7 14 232 243 244 233
247 3 2 7 14 233 244 245 234
248 3 2 7 14 234 245 246 235
249 3 2 7 14 235 246 247 236
250 3 2 7 14 236 247 248 237
251 3 2 7 14 237 248 249 238
252 3 2 7 14 238 249 250 239
253 3 2 7 14 239 250 251 240
254 3 2 7 14 240 251 252 241
255 3 2 7 14 241 252 253 242
256 3 2 7 14 242 253 76 77
257 3 2 7 14 40 41 254 243
258 3 2 7 14 243 254 255 244
259 3 2 7 14 244 255 256 245
260 3 2 7 14 245 256 257 246
261 3 2 7 14 246 257 258 247
262 3 2 7 14 247 258 259 248
263 3 2 7 14 248 259 260 249
264 3 2 7 14 249 260 261 250
265 3 2 7 14 250 261 262 251
266 3 2 7 14 251 262 263 252
267 3 2 7 14 252 263 264 253
268 3 2 7 14 253 264 75 76
269 3 2 7 14 41 42 265 254
270 3 2 7 14 254 265 266 255
271 3 2 7 14 255 266 267 256
272 3 2 7 14 256 267 268 257
273 3 2 7 14 257 268 269 258
274 3 2 7 14 258 269 270 259
275 3 2 7 14 259 270 271 260
276 3 2 7 14 260 271 272 261
277 3 2 7 14 261 272 273 262
278 3 2 7 14 262 273 274 263
279 3 2 7 14 263 274 275 264
280 3 2 7 14 264 275 74 75
281 3 2 7 14 42 43 276 265
282 3 2 7 14 265 276 277 266
283 3 2 7 14 266 277 278 267
284 3 2 7 14 267 278 279 268
285 3 2 7 14 268 279 280 269
286 3 2 7 14 269 280 281 270
287 3 2 7 14 270 281 282 271
288 3 2 7 14 271 282 283 272
289 3 2 7 14 272 283 284 273
290 3 2 7 14 273 284 285 274
291 3 2 7 14 274 285 286 275
292 3 2 7 14 275 286 73 74
293 3 2 7 14 43 44 287 276
294 3 2 7 14 276 287 288 277
295 3 2 7 14 277 288 289 278
296 3 2 7 14 278 289 290 279
297 3 2 7 14 279 290 291 280
298 3 2 7 14 280 291 292 281
299 3 2 7 14 281 292 293 282
300 3 2 7 14 282 293 294 283
301 3 2 7 14 283 294 295 284
302 3 2 7 14 284 295 296 285
303 3 2 7 14 285 296 297 286
304 3 2 7 14 286 297 72 73
305 3 2 7 14 44 45 298 287
306 3 2 7 14 287 298 299 288
307 3 2 7 14 288 299 300 289
308 3 2 7 14 289 300 301 290
309 3 2 7 14 290 301 302 291
310 3 2 7 14 291 302 303 292
311 3 2 7 14 292 303 304 293
312 3 2 7 14 293 304 305 294
313 3 2 7 14 294 305 306 295
314 3 2 7 14 295 306 307 296
315 3 2 7 14 296 307 308 297
316 3 2 7 14 297 308 71 72
317 3 2 7 14 45 46 309 298
318 3 2 7 14 298 309 310 299
319 3 2 7 14 299 310 311 300
320 3 2 7 14 300 311 312 301
321 3 2 7 14 301 312 313 302
322 3 2 7 14 302 313 314 303
323 3 2 7 14 303 314 315 304
324 3 2 7 14 304 315 316 305
325 3 2 7 14 305 316 317 306
326 3 2 7 14 306 317 318 307
327 3 2 7 14 307 318 319 308
328 3 2 7 14 308 319 70 71
329 3 2 7 14 46 47 320 309
330 3 2 7 14 309 320 321 310
331 3 2 7 14 310 321 322 311
332 3 2 7 14 311 322 323 312
333 3 2 7 14 312 323 324 313
334 3 2 7 14 313 324 325 314
335 3 2 7 14 314 325 326 315
336 3 2 7 14 315 326 327 316
337 3 2 7 14 316 327 328 317
338 3 2 7 14 317 328 329 318
339 3 2 7 14 318 329 330 319
340 3 2 7 14 319 330 69 70
341 3 2 7 14 47 48 331 320
342 3 2 7 14 320 331 332 321
343 3 2 7 14 321 332 333 322
344 3 2 7 14 322 333 334 323
345 3 2 7 14 323 334 335 324
346 3 2 7 14 324 335 336 325
347 3 2 7 14 325 336 337 326
348 3 2 7 14 326 337 338 327
349 3 2 7 14 327 338 339 328
350 3 2 7 14 328 339 340 329
351 3 2 7 14 329 340 341 330
352 3 2 7 14 330 341 68 69
353 3 2 7 14 48 1 99 331
354 3 2 7 14 331 99 98 332
355 3 2 7 14 332 98 97 333
356 3 2 7 14 333 97 96 334
357 3 2 7 14 334 96 95 335
358 3 2 7 14 335 95 94 336
359 3 2 7 14 336 94 93 337
360 3 2 7 14 337 93 92 338
361 3 2 7 14 338 92 91 339
362 3 2 7 14 339 91 90 340
363 3 2 7 14 340 90 89 341
364 3 2 7 14 341 89 7 68
365 3 2 7 16 8 81 342 100
366 3 2 7 16 100 342 343 101
367 3 2 7 16 101 343 344 102
368 3 2 7 16 102 344 345 103
369 3 2 7 16 103 345 346 104
370 3 2 7 16 104 346 347 105
371 3 2 7 16 105 347 348 106
372 3 2 7 16 106 348 349 107
373 3 2 7 16 107 349 350 108
374 3 2 7 16 108 350 351 109
375 3 2 7 16 109 351 352 110
376 3 2 7 16 110 352 35 4
377 3 2 7 16 81 82 353 342
378 3 2 7 16 342 353 354 343
379 3 2 7 16 343 354 355 344
380 3 2 7 16 344 355 356 345
381 3 2 7 16 345 356 357 346
382 3 2 7 16 346 357 358 347
383 3 2 7 16 347 358 359 348
384 3 2 7 16 348 359 360 349
385 3 2 7 16 349 360 361 350
386 3 2 7 16 350 361 362 351
387 3 2 7 16 351 362 363 352
388 3 2 7 16 352 363 34 35
389 3 2 7 16 82 83 364 353
390 3 2 7 16 353 364 365 354
391 3 2 7 16 354 365 366 355
392 3 2 7 16 355 366 367 356
393 3 2 7 16 356 367 368 357
394 3 2 7 16 357 368 369 358
395 3 2 7 16 358 369 370 359
396 3 2 7 16 359 370 371 360
397 3 2 7 16 360 371 372 361
398 3 2 7 16 361 372 373 362
399 3 2 7 16 362 373 374 363
400 3 2 7 16 363 374 33 34
401 3 2 7 16 83 84 375 364
402 3 2 7 16 364 375 376 365
403 3 2 7 16 365 376 377 366
404 3 2 7 16 366 377 378 367
405 3 2 7 16 367 378 379 368
406 3 2 7 16 368 379 380 369
407 3 2 7 16 369 380 381 370
408 3 2 7 16 370 381 382 371
409 3 2 7 16 371 382 383 372
410 3 2 7 16 372 383 384 373
411 3 2 7 16 373 384 385 374
412 3 2 7 16 374 385 32 33
413 3 2 7 16 84 85 386 375
414 3 2 7 16 375 386 387 376
415 3 2 7 16 376 387 388 377
416 3 2 7 16 377 388 389 378
417 3 2 7 16 378 389 390 379
418 3 2 7 16 379 390 391 380
419 3 2 7 16 380 391 392 381
420 3 2 7 16 381 392 393 382
421 3 2 7 16 382 393 394 383
422 3 2 7 16 383 394 395 384
423 3 2 7 16 384 395 396 385
424 3 2 7 16 385 396 31 32
425 3 2 7 16 85 86 397 386
426 3 2 7 16 386 397 398 387
427 3 2 7 16 387 398 399 388
428 3 2 7 16 388 399 400 389
429 3 2 7 16 389 400 401 390
430 3 2 7 16 390 401 402 391
431 3 2 7 16 391 402 403 392
432 3 2 7 16 392 403 404 393
433 3 2 7 16 393 404 405 394
434 3 2 7 16 394 405 406 395
435 3 2 7 16 395 406 407 396
436 3 2 7 16 396 407 30 31
437 3 2 7 16 86 87 408 397
438 3 2 7 16 397 408 409 398
439 3 2 7 16 398 409 410 399
440 3 2 7 16 399 410 411 400
441 3 2 7 16 400 411 412 401
442 3 2 7 16 401 412 413 402
443 3 2 7 16 402 413 414 403
444 3 2 7 16 403 414 415 404
445 3 2 7 16 404 415 416 405
446 3 2 7 16 405 416 417 406
447 3 2 7 16 406 417 418 407
448 3 2 7 16 407 418 29 30
449 3 2 7 16 87 88 419 408
450 3 2 7 16 408 419 420 409
451 3 2 7 16 409 420 421 410
452 3 2 7 16 410 421 422 411
453 3 2 7 16 411 422 423 412
454 3 2 7 16 412 423 424 413
455 3 2 7 16 413 424 425 414
456 3 2 7 16 414 425 426 415
457 3 2 7 16 415 426 427 416
458 3 2 7 16 416 427 428 417
459 3 2 7 16 417 428 429 418
460 3 2 7 16 418 429 28 29
461 3 2 7 16 88 5 49 419
462 3 2 7 16 419 49 50 420
463 3 2 7 16 420 50 51 421
464 3 2 7 16 421 51 52 422
465 3 2 7 16 422 52 53 423
466 3 2 7 16 423 53 54 424
467 3 2 7 16 424 54 55 425
468 3 2 7 16 425 55 56 426
469 3 2 7 16 426 56 57 427
470 3 2 7 16 427 57 58 428
471 3 2 7 16 428 58 59 429
472 3 2 7 16 429 59 3 28
$EndElements
