<?xml version="1.0" encoding="UTF-8" standalone="no"?>
<!-- Created with Inkscape (http://www.inkscape.org/) -->

<svg
   xmlns:dc="http://purl.org/dc/elements/1.1/"
   xmlns:cc="http://creativecommons.org/ns#"
   xmlns:rdf="http://www.w3.org/1999/02/22-rdf-syntax-ns#"
   xmlns:svg="http://www.w3.org/2000/svg"
   xmlns="http://www.w3.org/2000/svg"
   xmlns:xlink="http://www.w3.org/1999/xlink"
   xmlns:sodipodi="http://sodipodi.sourceforge.net/DTD/sodipodi-0.dtd"
   xmlns:inkscape="http://www.inkscape.org/namespaces/inkscape"
   width="210mm"
   height="297mm"
   id="svg3007"
   version="1.1"
   inkscape:version="0.48.2 r9819"
   sodipodi:docname="phenom_plaque.svg">
  <defs
     id="defs3009">
    <inkscape:path-effect
       effect="spiro"
       id="path-effect7422"
       is_visible="true" />
    <marker
       inkscape:stockid="DotL"
       orient="auto"
       refY="0.0"
       refX="0.0"
       id="DotL"
       style="overflow:visible">
      <path
         id="path4224"
         d="M -2.5,-1.0 C -2.5,1.7600000 -4.7400000,4.0 -7.5,4.0 C -10.260000,4.0 -12.5,1.7600000 -12.5,-1.0 C -12.5,-3.7600000 -10.260000,-6.0 -7.5,-6.0 C -4.7400000,-6.0 -2.5,-3.7600000 -2.5,-1.0 z "
         style="fill-rule:evenodd;stroke:#000000;stroke-width:1.0pt;marker-start:none;marker-end:none"
         transform="scale(0.8) translate(7.4, 1)" />
    </marker>
    <marker
       inkscape:stockid="Arrow1Lend"
       orient="auto"
       refY="0.0"
       refX="0.0"
       id="Arrow1Lend"
       style="overflow:visible;">
      <path
         id="path4165"
         d="M 0.0,0.0 L 5.0,-5.0 L -12.5,0.0 L 5.0,5.0 L 0.0,0.0 z "
         style="fill-rule:evenodd;stroke:#000000;stroke-width:1.0pt;marker-start:none;"
         transform="scale(0.8) rotate(180) translate(12.5,0)" />
    </marker>
    <marker
       inkscape:stockid="DotM"
       orient="auto"
       refY="0.0"
       refX="0.0"
       id="DotM"
       style="overflow:visible">
      <path
         id="path4227"
         d="M -2.5,-1.0 C -2.5,1.7600000 -4.7400000,4.0 -7.5,4.0 C -10.260000,4.0 -12.5,1.7600000 -12.5,-1.0 C -12.5,-3.7600000 -10.260000,-6.0 -7.5,-6.0 C -4.7400000,-6.0 -2.5,-3.7600000 -2.5,-1.0 z "
         style="fill-rule:evenodd;stroke:#000000;stroke-width:1.0pt;marker-start:none;marker-end:none"
         transform="scale(0.4) translate(7.4, 1)" />
    </marker>
    <marker
       inkscape:stockid="Arrow2Lend"
       orient="auto"
       refY="0.0"
       refX="0.0"
       id="Arrow2Lend"
       style="overflow:visible;">
      <path
         id="path4183"
         style="font-size:12.0;fill-rule:evenodd;stroke-width:0.62500000;stroke-linejoin:round;"
         d="M 8.7185878,4.0337352 L -2.2072895,0.016013256 L 8.7185884,-4.0017078 C 6.9730900,-1.6296469 6.9831476,1.6157441 8.7185878,4.0337352 z "
         transform="scale(1.1) rotate(180) translate(1,0)" />
    </marker>
    <linearGradient
       id="linearGradient4055">
      <stop
         style="stop-color:#000000;stop-opacity:0.94308943;"
         offset="0"
         id="stop4073" />
      <stop
         id="stop4089"
         offset="0.66000003"
         style="stop-color:#626262;stop-opacity:0.96862745;" />
      <stop
         style="stop-color:#939393;stop-opacity:0.98431373;"
         offset="0.66000003"
         id="stop4091" />
      <stop
         style="stop-color:#c4c4c4;stop-opacity:1;"
         offset="1"
         id="stop4069" />
    </linearGradient>
    <linearGradient
       id="linearGradient3805">
      <stop
         style="stop-color:#000000;stop-opacity:1;"
         offset="0"
         id="stop3807" />
      <stop
         style="stop-color:#000000;stop-opacity:0;"
         offset="1"
         id="stop3809" />
    </linearGradient>
    <radialGradient
       inkscape:collect="always"
       xlink:href="#linearGradient3805"
       id="radialGradient3811"
       cx="249.50768"
       cy="283.13101"
       fx="249.50768"
       fy="283.13101"
       r="162.63457"
       gradientTransform="matrix(1,0,0,0.23913042,0,215.42577)"
       gradientUnits="userSpaceOnUse" />
    <marker
       inkscape:stockid="Arrow2Lend"
       orient="auto"
       refY="0"
       refX="0"
       id="Arrow2Lend-7"
       style="overflow:visible">
      <path
         inkscape:connector-curvature="0"
         id="path4183-6"
         style="font-size:12px;fill-rule:evenodd;stroke-width:0.625;stroke-linejoin:round"
         d="M 8.7185878,4.0337352 -2.2072895,0.01601326 8.7185884,-4.0017078 c -1.7454984,2.3720609 -1.7354408,5.6174519 -6e-7,8.035443 z"
         transform="matrix(-1.1,0,0,-1.1,-1.1,0)" />
    </marker>
    <marker
       inkscape:stockid="Arrow2Lend"
       orient="auto"
       refY="0"
       refX="0"
       id="Arrow2Lend-4"
       style="overflow:visible">
      <path
         inkscape:connector-curvature="0"
         id="path4183-2"
         style="font-size:12px;fill-rule:evenodd;stroke-width:0.625;stroke-linejoin:round"
         d="M 8.7185878,4.0337352 -2.2072895,0.01601326 8.7185884,-4.0017078 c -1.7454984,2.3720609 -1.7354408,5.6174519 -6e-7,8.035443 z"
         transform="matrix(-1.1,0,0,-1.1,-1.1,0)" />
    </marker>
    <marker
       inkscape:stockid="Arrow2Lend"
       orient="auto"
       refY="0"
       refX="0"
       id="Arrow2Lend-76"
       style="overflow:visible">
      <path
         inkscape:connector-curvature="0"
         id="path4183-1"
         style="font-size:12px;fill-rule:evenodd;stroke-width:0.625;stroke-linejoin:round"
         d="M 8.7185878,4.0337352 -2.2072895,0.01601326 8.7185884,-4.0017078 c -1.7454984,2.3720609 -1.7354408,5.6174519 -6e-7,8.035443 z"
         transform="matrix(-1.1,0,0,-1.1,-1.1,0)" />
    </marker>
    <marker
       inkscape:stockid="Arrow2Lend"
       orient="auto"
       refY="0"
       refX="0"
       id="Arrow2Lend-9"
       style="overflow:visible">
      <path
         inkscape:connector-curvature="0"
         id="path4183-27"
         style="font-size:12px;fill-rule:evenodd;stroke-width:0.625;stroke-linejoin:round"
         d="M 8.7185878,4.0337352 -2.2072895,0.01601326 8.7185884,-4.0017078 c -1.7454984,2.3720609 -1.7354408,5.6174519 -6e-7,8.035443 z"
         transform="matrix(-1.1,0,0,-1.1,-1.1,0)" />
    </marker>
    <filter
       inkscape:collect="always"
       id="filter6762"
       x="-0.12123012"
       width="1.2424602"
       y="-0.18667731"
       height="1.3733546">
      <feGaussianBlur
         inkscape:collect="always"
         stdDeviation="9.7100997"
         id="feGaussianBlur6764" />
    </filter>
    <marker
       inkscape:stockid="DotM"
       orient="auto"
       refY="0"
       refX="0"
       id="DotM-1"
       style="overflow:visible">
      <path
         inkscape:connector-curvature="0"
         id="path4227-2"
         d="m -2.5,-1 c 0,2.76 -2.24,5 -5,5 -2.76,0 -5,-2.24 -5,-5 0,-2.76 2.24,-5 5,-5 2.76,0 5,2.24 5,5 z"
         style="fill-rule:evenodd;stroke:#000000;stroke-width:1pt;marker-start:none;marker-end:none"
         transform="matrix(0.4,0,0,0.4,2.96,0.4)" />
    </marker>
    <marker
       inkscape:stockid="Arrow2Lend"
       orient="auto"
       refY="0"
       refX="0"
       id="Arrow2Lend-9-3"
       style="overflow:visible">
      <path
         inkscape:connector-curvature="0"
         id="path4183-27-3"
         style="font-size:12px;fill-rule:evenodd;stroke-width:0.625;stroke-linejoin:round"
         d="M 8.7185878,4.0337352 -2.2072895,0.01601326 8.7185884,-4.0017078 c -1.7454984,2.3720609 -1.7354408,5.6174519 -6e-7,8.035443 z"
         transform="matrix(-1.1,0,0,-1.1,-1.1,0)" />
    </marker>
    <marker
       inkscape:stockid="DotM"
       orient="auto"
       refY="0"
       refX="0"
       id="DotM-1-8"
       style="overflow:visible">
      <path
         inkscape:connector-curvature="0"
         id="path4227-2-6"
         d="m -2.5,-1 c 0,2.76 -2.24,5 -5,5 -2.76,0 -5,-2.24 -5,-5 0,-2.76 2.24,-5 5,-5 2.76,0 5,2.24 5,5 z"
         style="fill-rule:evenodd;stroke:#000000;stroke-width:1pt;marker-start:none;marker-end:none"
         transform="matrix(0.4,0,0,0.4,2.96,0.4)" />
    </marker>
    <marker
       inkscape:stockid="Arrow2Lend"
       orient="auto"
       refY="0"
       refX="0"
       id="Arrow2Lend-9-3-0"
       style="overflow:visible">
      <path
         inkscape:connector-curvature="0"
         id="path4183-27-3-2"
         style="font-size:12px;fill-rule:evenodd;stroke-width:0.625;stroke-linejoin:round"
         d="M 8.7185878,4.0337352 -2.2072895,0.01601326 8.7185884,-4.0017078 c -1.7454984,2.3720609 -1.7354408,5.6174519 -6e-7,8.035443 z"
         transform="matrix(-1.1,0,0,-1.1,-1.1,0)" />
    </marker>
    <inkscape:path-effect
       effect="spiro"
       id="path-effect7422-4"
       is_visible="true" />
    <marker
       inkscape:stockid="Arrow2Lend"
       orient="auto"
       refY="0"
       refX="0"
       id="marker10879"
       style="overflow:visible">
      <path
         inkscape:connector-curvature="0"
         id="path10881"
         style="font-size:12px;fill-rule:evenodd;stroke-width:0.625;stroke-linejoin:round"
         d="M 8.7185878,4.0337352 -2.2072895,0.01601326 8.7185884,-4.0017078 c -1.7454984,2.3720609 -1.7354408,5.6174519 -6e-7,8.035443 z"
         transform="matrix(-1.1,0,0,-1.1,-1.1,0)" />
    </marker>
  </defs>
  <sodipodi:namedview
     id="base"
     pagecolor="#ffffff"
     bordercolor="#666666"
     borderopacity="1.0"
     inkscape:pageopacity="0.0"
     inkscape:pageshadow="2"
     inkscape:zoom="0.7"
     inkscape:cx="543.12671"
     inkscape:cy="656.90722"
     inkscape:document-units="px"
     inkscape:current-layer="g4603"
     showgrid="false"
     inkscape:window-width="1272"
     inkscape:window-height="923"
     inkscape:window-x="-4"
     inkscape:window-y="-4"
     inkscape:window-maximized="1" />
  <metadata
     id="metadata3012">
    <rdf:RDF>
      <cc:Work
         rdf:about="">
        <dc:format>image/svg+xml</dc:format>
        <dc:type
           rdf:resource="http://purl.org/dc/dcmitype/StillImage" />
      </cc:Work>
    </rdf:RDF>
  </metadata>
  <g
     inkscape:label="Calque 1"
     inkscape:groupmode="layer"
     id="layer1">
    <g
       id="g4603">
      <rect
         y="320.37613"
         x="285.08881"
         height="124.83702"
         width="192.23143"
         id="rect3015"
         style="fill:#a1a1a1;fill-opacity:1;fill-rule:nonzero;stroke:none" />
      <rect
         y="445.21317"
         x="285.08881"
         height="124.83702"
         width="192.23143"
         id="rect3015-1"
         style="fill:#191919;fill-opacity:1;fill-rule:nonzero;stroke:none" />
      <rect
         transform="matrix(1.574649,0,0,1,-426.22042,-388.90873)"
         y="758.61871"
         x="411.99103"
         height="124.83702"
         width="192.23143"
         id="rect3015-15"
         style="fill:#454545;fill-opacity:1;fill-rule:nonzero;stroke:none;filter:url(#filter6762)" />
      <rect
         y="320.37613"
         x="203.26645"
         height="264.65997"
         width="81.822357"
         id="rect4137"
         style="fill:#ffffff;fill-opacity:1;fill-rule:nonzero;stroke:none" />
      <rect
         y="320.37613"
         x="477.32025"
         height="264.65997"
         width="81.822357"
         id="rect4137-2"
         style="fill:#ffffff;fill-opacity:1;fill-rule:nonzero;stroke:none" />
      <text
         xml:space="preserve"
         style="font-size:16px;font-style:normal;font-variant:normal;font-weight:normal;font-stretch:normal;line-height:125%;letter-spacing:0px;word-spacing:0px;fill:#000000;fill-opacity:1;stroke:none;font-family:Arial;-inkscape-font-specification:Arial"
         x="-486.39117"
         y="448.84436"
         id="text6766"
         sodipodi:linespacing="125%"
         transform="matrix(0,-1,1,0,0,0)"><tspan
           sodipodi:role="line"
           id="tspan6768"
           x="-486.39117"
           y="448.84436"
           style="font-size:14px">Conduction thermique</tspan></text>
      <path
         style="fill:none;stroke:#000000;stroke-width:1px;stroke-linecap:butt;stroke-linejoin:miter;stroke-opacity:1;marker-start:url(#DotM);marker-end:url(#Arrow2Lend-9)"
         d="m 419.03056,501.93816 0,-216.27567"
         id="path6770"
         inkscape:connector-curvature="0" />
      <text
         xml:space="preserve"
         style="font-size:16px;font-style:normal;font-variant:normal;font-weight:normal;font-stretch:normal;line-height:125%;letter-spacing:0px;word-spacing:0px;fill:#000000;fill-opacity:1;stroke:none;font-family:Arial;-inkscape-font-specification:Arial"
         x="-282.77271"
         y="424.62332"
         id="text7360"
         sodipodi:linespacing="125%"
         transform="matrix(0,-1,1,0,0,0)"><tspan
           sodipodi:role="line"
           id="tspan7362"
           x="-282.77271"
           y="424.62332"
           style="font-size:14px">Ejection des gaz </tspan><tspan
           sodipodi:role="line"
           x="-282.77271"
           y="444.62332"
           id="tspan7364"
           style="font-size:14px">de décomposition</tspan></text>
      <path
         style="fill:none;stroke:#000000;stroke-width:0.99999994px;stroke-linecap:butt;stroke-linejoin:miter;stroke-opacity:1;marker-start:url(#DotM);marker-end:url(#Arrow2Lend-9)"
         d="m 366.72329,320.45728 0,-34.79479"
         id="path6770-4"
         inkscape:connector-curvature="0" />
      <text
         xml:space="preserve"
         style="font-size:16px;font-style:normal;font-variant:normal;font-weight:normal;font-stretch:normal;line-height:125%;letter-spacing:0px;word-spacing:0px;fill:#000000;fill-opacity:1;stroke:none;font-family:Arial;-inkscape-font-specification:Arial"
         x="-282.77271"
         y="370.69406"
         id="text7360-1"
         sodipodi:linespacing="125%"
         transform="matrix(0,-1,1,0,0,0)"><tspan
           sodipodi:role="line"
           id="tspan7362-1"
           x="-282.77271"
           y="370.69406"
           style="font-size:14px">Inflammation des gaz </tspan><tspan
           sodipodi:role="line"
           x="-282.77271"
           y="388.19406"
           id="tspan7364-3"
           style="font-size:14px">de décomposition</tspan></text>
      <g
         id="g9628"
         transform="translate(12.946429,-1.5178571)">
        <path
           sodipodi:nodetypes="cssc"
           inkscape:connector-curvature="0"
           inkscape:original-d="m 323.27375,296.29074 c 0,0 12.35897,5.65218 5.03452,18.36953 -3.73949,6.49282 -16.05213,-1.18545 -21.59137,-0.46071 -6.16934,0.80718 10.08291,-13.18203 10.08291,-13.18203"
           inkscape:path-effect="#path-effect7422"
           id="path7420"
           d="m 323.27375,296.29074 c 2.98344,1.82422 5.2322,4.81477 6.15652,8.18736 0.92432,3.37259 0.5145,7.09176 -1.122,10.18217 -1.07201,2.02442 -2.65845,3.78092 -4.59139,5.01024 -1.93295,1.22932 -4.21051,1.92319 -6.50124,1.92992 -2.29074,0.007 -4.58613,-0.68067 -6.46798,-1.98687 -1.88185,-1.30619 -3.33596,-3.23117 -4.03076,-5.414 -0.98354,-3.08996 -0.36473,-6.64363 1.60537,-9.21927 1.9701,-2.57563 5.23787,-4.10313 8.47754,-3.96276"
           style="fill:none;stroke:#000000;stroke-width:1px;stroke-linecap:butt;stroke-linejoin:miter;stroke-opacity:1;marker-end:none" />
        <path
           inkscape:connector-curvature="0"
           id="path9226"
           d="m 318.831,298.80273 1.14526,-0.53176"
           style="fill:none;stroke:#000000;stroke-width:1px;stroke-linecap:butt;stroke-linejoin:miter;stroke-opacity:1;marker-end:url(#Arrow2Lend-9-3)" />
      </g>
      <path
         style="fill:none;stroke:#000000;stroke-width:1px;stroke-linecap:butt;stroke-linejoin:miter;stroke-opacity:1;marker-start:url(#DotM-1);marker-end:url(#Arrow2Lend-9-3)"
         d="m 307.33891,320.50666 -12.6269,-6.70989 14.39467,-3.06321 -13.51079,-8.35089 13.25825,-2.69855 -13.63705,-9.08023"
         id="path10434"
         inkscape:connector-curvature="0"
         sodipodi:nodetypes="cccccc" />
      <text
         xml:space="preserve"
         style="font-size:16px;font-style:normal;font-variant:normal;font-weight:normal;font-stretch:normal;line-height:125%;letter-spacing:0px;word-spacing:0px;fill:#000000;fill-opacity:1;stroke:none;font-family:Arial;-inkscape-font-specification:Arial"
         x="210.83821"
         y="267.63605"
         id="text7360-1-8"
         sodipodi:linespacing="125%"><tspan
           sodipodi:role="line"
           x="210.83821"
           y="267.63605"
           id="tspan7364-3-4"
           style="font-size:14px">Echanges radiatifs et </tspan><tspan
           sodipodi:role="line"
           x="210.83821"
           y="285.13605"
           style="font-size:14px"
           id="tspan10862">convectifs de surface</tspan></text>
    </g>
    <path
       style="fill:none;stroke:#000000;stroke-width:1px;stroke-linecap:butt;stroke-linejoin:miter;stroke-opacity:1;marker-end:url(#Arrow2Lend)"
       d="m 534.12235,538.64305 -51.51778,0"
       id="path4157"
       inkscape:connector-curvature="0" />
    <path
       style="fill:none;stroke:#000000;stroke-width:1px;stroke-linecap:butt;stroke-linejoin:miter;stroke-opacity:1;marker-end:url(#Arrow2Lend)"
       d="m 534.12235,428.05885 -51.51778,0"
       id="path4157-1"
       inkscape:connector-curvature="0" />
    <path
       style="fill:none;stroke:#000000;stroke-width:1px;stroke-linecap:butt;stroke-linejoin:miter;stroke-opacity:1;marker-end:url(#Arrow2Lend)"
       d="m 534.12235,340.91599 -51.51778,0"
       id="path4157-3"
       inkscape:connector-curvature="0" />
    <text
       xml:space="preserve"
       style="font-size:16px;font-style:normal;font-variant:normal;font-weight:normal;font-stretch:normal;line-height:125%;letter-spacing:0px;word-spacing:0px;fill:#000000;fill-opacity:1;stroke:none;font-family:Arial;-inkscape-font-specification:Arial"
       x="537.83038"
       y="344.81577"
       id="text4645"
       sodipodi:linespacing="125%"><tspan
         sodipodi:role="line"
         id="tspan4647"
         x="537.83038"
         y="344.81577"
         style="font-size:14px">Fibres dégradées</tspan><tspan
         sodipodi:role="line"
         x="537.83038"
         y="364.81577"
         id="tspan4649"
         style="font-size:14px">+ Matrice dégradée</tspan></text>
    <text
       xml:space="preserve"
       style="font-size:16px;font-style:normal;font-variant:normal;font-weight:normal;font-stretch:normal;line-height:125%;letter-spacing:0px;word-spacing:0px;fill:#000000;fill-opacity:1;stroke:none;font-family:Arial;-inkscape-font-specification:Arial"
       x="537.83038"
       y="542.3703"
       id="text4645-2"
       sodipodi:linespacing="125%"><tspan
         sodipodi:role="line"
         id="tspan4647-2"
         x="537.83038"
         y="542.3703"
         style="font-size:14px">Fibres vierges</tspan><tspan
         sodipodi:role="line"
         x="537.83038"
         y="562.3703"
         id="tspan4649-1"
         style="font-size:14px">+ Matrice vierge</tspan></text>
    <text
       xml:space="preserve"
       style="font-size:16px;font-style:normal;font-variant:normal;font-weight:normal;font-stretch:normal;line-height:125%;letter-spacing:0px;word-spacing:0px;fill:#000000;fill-opacity:1;stroke:none;font-family:Arial;-inkscape-font-specification:Arial"
       x="537.83038"
       y="432.86496"
       id="text4645-6"
       sodipodi:linespacing="125%"><tspan
         sodipodi:role="line"
         id="tspan4647-8"
         x="537.83038"
         y="432.86496"
         style="font-size:14px">Fibres vierges</tspan><tspan
         sodipodi:role="line"
         x="537.83038"
         y="452.86496"
         id="tspan4649-5"
         style="font-size:14px">+ Matrice dégradée</tspan></text>
    <path
       style="fill:none;stroke:#000000;stroke-width:1px;stroke-linecap:butt;stroke-linejoin:miter;stroke-opacity:1;marker-end:url(#Arrow2Lend)"
       d="m 223.83987,379.6182 51.51778,0"
       id="path4157-1-8"
       inkscape:connector-curvature="0" />
    <path
       style="fill:none;stroke:#000000;stroke-width:1px;stroke-linecap:butt;stroke-linejoin:miter;stroke-opacity:1;marker-end:url(#Arrow2Lend)"
       d="m 223.83987,492.25021 51.51778,0"
       id="path4157-1-8-9"
       inkscape:connector-curvature="0" />
    <text
       xml:space="preserve"
       style="font-size:16px;font-style:normal;font-variant:normal;font-weight:normal;font-stretch:normal;line-height:125%;letter-spacing:0px;word-spacing:0px;fill:#000000;fill-opacity:1;stroke:none;font-family:Arial;-inkscape-font-specification:Arial"
       x="218.61273"
       y="496.64792"
       id="text4760"
       sodipodi:linespacing="125%"><tspan
         sodipodi:role="line"
         id="tspan4762"
         x="218.61273"
         y="496.64792"
         style="text-align:end;text-anchor:end;font-size:14px">Front de</tspan><tspan
         sodipodi:role="line"
         x="218.61273"
         y="516.64789"
         id="tspan4764"
         style="text-align:end;text-anchor:end;font-size:14px">pyrolyse</tspan></text>
    <text
       xml:space="preserve"
       style="font-size:16px;font-style:normal;font-variant:normal;font-weight:normal;font-stretch:normal;line-height:125%;letter-spacing:0px;word-spacing:0px;fill:#000000;fill-opacity:1;stroke:none;font-family:Arial;-inkscape-font-specification:Arial"
       x="218.12556"
       y="384.97659"
       id="text4760-5"
       sodipodi:linespacing="125%"><tspan
         sodipodi:role="line"
         x="222.56306"
         y="384.97659"
         id="tspan4764-3"
         style="text-align:end;text-anchor:end;font-size:14px">Front </tspan><tspan
         sodipodi:role="line"
         x="218.12556"
         y="404.97659"
         id="tspan4792"
         style="text-align:end;text-anchor:end;font-size:14px">d'oxydation</tspan></text>
    <path
       style="fill:none;stroke:#000000;stroke-width:1px;stroke-linecap:butt;stroke-linejoin:miter;stroke-opacity:1;marker-start:url(#DotM);marker-end:url(#Arrow2Lend-9)"
       d="m 455.5788,324.04219 0,240.83126"
       id="path5380"
       inkscape:connector-curvature="0" />
    <g
       id="g9628-8"
       transform="matrix(-1,0,0,-1,648.27478,893.90439)">
      <path
         sodipodi:nodetypes="cssc"
         inkscape:connector-curvature="0"
         inkscape:original-d="m 323.27375,296.29074 c 0,0 12.35897,5.65218 5.03452,18.36953 -3.73949,6.49282 -16.05213,-1.18545 -21.59137,-0.46071 -6.16934,0.80718 10.08291,-13.18203 10.08291,-13.18203"
         inkscape:path-effect="#path-effect7422-4"
         id="path7420-6"
         d="m 323.27375,296.29074 c 2.98344,1.82422 5.2322,4.81477 6.15652,8.18736 0.92432,3.37259 0.5145,7.09176 -1.122,10.18217 -1.07201,2.02442 -2.65845,3.78092 -4.59139,5.01024 -1.93295,1.22932 -4.21051,1.92319 -6.50124,1.92992 -2.29074,0.007 -4.58613,-0.68067 -6.46798,-1.98687 -1.88185,-1.30619 -3.33596,-3.23117 -4.03076,-5.414 -0.98354,-3.08996 -0.36473,-6.64363 1.60537,-9.21927 1.9701,-2.57563 5.23787,-4.10313 8.47754,-3.96276"
         style="fill:none;stroke:#000000;stroke-width:1px;stroke-linecap:butt;stroke-linejoin:miter;stroke-opacity:1;marker-end:none" />
      <path
         inkscape:connector-curvature="0"
         id="path9226-5"
         d="m 318.831,298.80273 1.14526,-0.53176"
         style="fill:none;stroke:#000000;stroke-width:1px;stroke-linecap:butt;stroke-linejoin:miter;stroke-opacity:1;marker-end:url(#Arrow2Lend-9-3)" />
    </g>
    <path
       style="fill:none;stroke:#000000;stroke-width:1px;stroke-linecap:butt;stroke-linejoin:miter;stroke-opacity:1;marker-start:url(#DotM-1);marker-end:url(#Arrow2Lend-9-3)"
       d="m 295.54407,569.68254 12.6269,6.70989 -14.39467,3.06321 13.51079,8.35089 -13.25825,2.69855 13.63705,9.08023"
       id="path10434-0"
       inkscape:connector-curvature="0"
       sodipodi:nodetypes="cccccc" />
    <text
       xml:space="preserve"
       style="font-size:16px;font-style:normal;font-variant:normal;font-weight:normal;font-stretch:normal;line-height:125%;letter-spacing:0px;word-spacing:0px;fill:#000000;fill-opacity:1;stroke:none;font-family:Arial;-inkscape-font-specification:Arial"
       x="212.49484"
       y="616.23853"
       id="text7360-1-8-9"
       sodipodi:linespacing="125%"><tspan
         sodipodi:role="line"
         x="212.49484"
         y="616.23853"
         id="tspan7364-3-4-0"
         style="font-size:14px">Echanges radiatifs et </tspan><tspan
         sodipodi:role="line"
         x="212.49484"
         y="633.73853"
         style="font-size:14px"
         id="tspan10862-0">convectifs de surface</tspan></text>
  </g>
</svg>
