[
    {
        "model": "adminlte.attribute",
        "pk": 1,
        "fields": {
          "name": "project_name",
          "value": "Mon premier dashboard"
        }
    },
    {
        "model": "adminlte.attribute",
        "pk": 2,
        "fields": {
          "name": "project_logo",
          "value": "img/logo_datactio_white.png"
        }
    },
    {
      "model": "adminlte.attribute",
      "pk": 3,
      "fields": {
        "name": "username",
        "value": "Unknown user"
      }
    },
    {
        "model": "adminlte.attribute",
        "pk": 4,
        "fields": {
          "name": "avatar",
          "value": "img/avatar_default.jpg"
        }
    },
    {
        "model": "adminlte.attribute",
        "pk": 5,
        "fields": {
          "name": "footer_message",
          "value": "Copyright &copy; 2020 <a href='https://datact.io'>datact.io</a>. All rights reserved."
        }
    }
]