URL1 = jdbc:mysql://10.0.0.177:3306/triade
URL2 = jdbc:mysql://189.26.114.18:3306/fidare
URL3 = jdbc:mysql://192.168.0.245:3306/nepalign
URL = jdbc:mysql://200.150.73.66:3306/nepalign
URL4 = jdbc:mysql://triadee.no-ip.org:3306/triade
URL5 = jdbc:mysql://localhost:3306/topcitrus
USUARIO = root
SENHA1 = desenv3377
SENHA = vitoria7
SENHA2=triade@3377
SENHA5=topmysql@999
DRIVER = com.mysql.jdbc.Driver