module gitlab.com/vajar_minigame/proto_go

go 1.14

require (
	github.com/golang/protobuf v1.4.3
	golang.org/x/net v0.0.0-20210119194325-5f4716e94777 // indirect
	golang.org/x/sys v0.0.0-20210124154548-22da62e12c0c // indirect
	golang.org/x/text v0.3.5 // indirect
	google.golang.org/genproto v0.0.0-20210126160654-44e461bb6506 // indirect
	google.golang.org/grpc v1.35.0
	google.golang.org/protobuf v1.25.0
)
