Endpoint is :
https://reqres.in/api/users

Request body is :
{
    "name": "Vaishnavi",
    "job": "Engg"
}

Response header date is : 
Sun, 17 Mar 2024 16:07:49 GMT

Response body is : 
https://reqres.in/api/users