[
    [
        [
            "Info katse kohta:"
        ],
        [
            "Katse:",
            "",
            "AG võistlus (Eesti meistrivõistlused, EKL punktiarvestuses)"
        ],
        [
            "Aeg:",
            "",
            "04.08.2012"
        ],
        [
            "Koht:",
            "",
            "Pärnumaa"
        ],
        [
            "Korraldaja:",
            "",
            "Eesti Kennelliidu Koolitust Koordineeriv Kogu (EKL-KKK)"
        ],
        [
            "Kohtunik:",
            "",
            "Johanna Nyberg"
        ],
        [
            "",
            "Lisainfo: Võistlus korraldatakse koostöös Pärnu Piirkondliku Koerakasvatajate Klubiga"
        ],
        [
            "Lisainfo: Võistlus korraldatakse koostöös Pärnu Piirkondliku Koerakasvatajate Klubiga"
        ],
        [
            "Lisainfo: Võistlus korraldatakse koostöös Pärnu Piirkondliku Koerakasvatajate Klubiga"
        ],
        []
    ],
    [
        [
            ""
        ],
        [
            "Tulemused (47):"
        ],
        [
            "Tegemist on võistluse koondtulemustega, radade tulemused eraldi on nähtavad järgnevatel linkidel:\n       rada 1, rada 2."
        ]
    ],
    [
        [
            "Klass",
            "Koer",
            "Hüüdnimi",
            "Tõug",
            "Koerajuht",
            "Aeg",
            "Ajavead",
            "Vead",
            "Punktid",
            "Koht"
        ],
        [
            "AG-3",
            "mini",
            "Millgret Fantastic Feeling",
            "Willi",
            "KP",
            "Ede Brand",
            "81.3",
            "0",
            "0",
            "0",
            "1"
        ],
        [
            "AG-3",
            "mini",
            "Helandros Key To My Heart",
            "Phoebe",
            "CKS",
            "Piret Reinsalu",
            "81.89",
            "0",
            "0",
            "0",
            "2"
        ],
        [
            "AG-3",
            "mini",
            "Metunai Relly",
            "Relly",
            "MP",
            "Stefi Praakli",
            "83.01",
            "0",
            "0",
            "0",
            "3"
        ],
        [
            "AG-3",
            "mini",
            "Kribu-Krabu Pässu-Nässu",
            "Kribu",
            "MIX",
            "Jane Tüksammel",
            "91.39",
            "1.67",
            "0",
            "1.67",
            "4"
        ],
        [
            "AG-3",
            "mini",
            "Royal Fantasy French Rose",
            "Liisu",
            "CKS",
            "Jana Kima",
            "94.04",
            "2.04",
            "0",
            "2.04",
            "5"
        ],
        [
            "AG-3",
            "mini",
            "Fire Rock Bree",
            "Bree",
            "PAP",
            "Mariann Rebane",
            "83.53",
            "0",
            "5",
            "5",
            "6"
        ],
        [
            "AG-3",
            "mini",
            "Viking",
            "Viking",
            "JRT",
            "Natalja Sazonova",
            "91.54",
            "0.09",
            "5",
            "5.09",
            "7"
        ],
        [
            "AG-3",
            "mini",
            "Royal Fantasy Femme Fatale",
            "Femmie",
            "CKS",
            "Maarja Haljasmäe",
            "97.61",
            "5.61",
            "0",
            "5.61",
            "8"
        ],
        [
            "AG-3",
            "mini",
            "Jasper",
            "Jasper",
            "MIX",
            "Maria Teng",
            "102.61",
            "10.61",
            "5",
            "15.61",
            "9"
        ],
        [
            "AG-3",
            "mini",
            "Käpylä Mosku",
            "Muki",
            "SKS",
            "Külli Ragel",
            "100.16",
            "8.16",
            "20",
            "28.16",
            "10"
        ],
        [
            "AG-3",
            "mini",
            "Pudik",
            "Pudik",
            "MIX",
            "Jelena Virro",
            "117.42",
            "25.42",
            "15",
            "40.42",
            "11"
        ],
        [
            "AG-3",
            "mini",
            "Volfrad Saga's Ode To Sehkmeth",
            "Runa",
            "VBG",
            "Jelena Marzaljuk",
            "38.95",
            "0",
            "100",
            "100",
            "12"
        ],
        [
            "AG-3",
            "mini",
            "Siimline's How Do U Like Me Now",
            "Nupi",
            "MP",
            "Jane Tüksammel",
            "39.48",
            "0",
            "100",
            "100",
            "13"
        ],
        [
            "AG-3",
            "mini",
            "Elbar's Golden Dominik",
            "Stenley",
            "SHE",
            "Dmitri Kargin",
            "40.24",
            "0",
            "100",
            "100",
            "14"
        ],
        [
            "AG-3",
            "mini",
            "Wonder Babe Of Happytails",
            "Lill",
            "WT",
            "Tiina Jürjo",
            "40.4",
            "0",
            "100",
            "100",
            "15"
        ],
        [
            "AG-3",
            "mini",
            "Helandros It's Magic",
            "Charly",
            "CKS",
            "Elika Salonen",
            "45.16",
            "0",
            "100",
            "100",
            "16"
        ],
        [
            "AG-3",
            "mini",
            "Just Patrick van Statum",
            "Pätrik",
            "JRT",
            "Epp Keevallik",
            "54.62",
            "11.62",
            "105",
            "116.62",
            "17"
        ],
        [
            "AG-3",
            "midi",
            "Nevskaja Zhemchuzhina Pikkolo",
            "Piko",
            "VP",
            "Liivika Pärg",
            "79.9",
            "0",
            "0",
            "0",
            "1"
        ],
        [
            "AG-3",
            "midi",
            "Catella Noel",
            "Fidel",
            "VP",
            "Eva-Liis Loogväli",
            "80.28",
            "0",
            "0",
            "0",
            "2"
        ],
        [
            "AG-3",
            "midi",
            "Spotty",
            "Lotta",
            "BGL",
            "Indrek Katushin",
            "89.14",
            "0",
            "5",
            "5",
            "3"
        ],
        [
            "AG-3",
            "midi",
            "Ak Mil Vista Captain Cedric",
            "Sedrik",
            "WT",
            "Tiina Jürjo",
            "96.07",
            "4.07",
            "5",
            "9.07",
            "4"
        ],
        [
            "AG-3",
            "midi",
            "Mooncraft's As You Like",
            "Thor",
            "SBT",
            "Jelena Marzaljuk",
            "94.42",
            "2.42",
            "20",
            "22.42",
            "5"
        ],
        [
            "AG-3",
            "midi",
            "Dalylove Exclusive Essense",
            "Bibi",
            "MAT",
            "Aleksander Andre",
            "101.61",
            "13.06",
            "20",
            "33.06",
            "6"
        ],
        [
            "AG-3",
            "midi",
            "Soft And Furry Kamilla",
            "Tika",
            "GHT",
            "Natalja Garastsenko",
            "43.57",
            "0",
            "100",
            "100",
            "7"
        ],
        [
            "AG-3",
            "midi",
            "Falaris Favourite",
            "Figo",
            "SBT",
            "Imbi Soa",
            "46.24",
            "3.24",
            "105",
            "108.24",
            "8"
        ],
        [
            "AG-3",
            "midi",
            "Mileedi",
            "Liisu",
            "AKS",
            "Ene Kaldoja",
            "62.83",
            "13.83",
            "105",
            "118.83",
            "9"
        ],
        [
            "AG-3",
            "midi",
            "Excellent Choice The Power Of Three",
            "Džoker",
            "SHE",
            "Kristina Lukašejeva",
            "0",
            "0",
            "200",
            "200",
            ""
        ],
        [
            "AG-3",
            "maksi",
            "Maeglin Hurricane",
            "Bolt",
            "BC",
            "Natalja Garastsenko",
            "70.1",
            "0",
            "0",
            "0",
            "1"
        ],
        [
            "AG-3",
            "maksi",
            "Tending Eagle-Eyed",
            "Rika",
            "BC",
            "Anne Tammiksalu",
            "76.56",
            "0",
            "10",
            "10",
            "2"
        ],
        [
            "AG-3",
            "maksi",
            "Dark'Un's Hartelijk-Blij",
            "Jeti",
            "HLK",
            "Keida Tirmaste",
            "76.77",
            "0",
            "10",
            "10",
            "3"
        ],
        [
            "AG-3",
            "maksi",
            "Bonvivant Yvre",
            "Lili",
            "MAL",
            "Tiia Jatsa",
            "82.82",
            "0",
            "15",
            "15",
            "4"
        ],
        [
            "AG-3",
            "maksi",
            "Heleros Zirana",
            "Rexsiina",
            "SLK",
            "Kristiina Mölder",
            "101.33",
            "9.33",
            "10",
            "19.33",
            "5"
        ],
        [
            "AG-3",
            "maksi",
            "Amazing Grace of Shamrock Field",
            "Roxy",
            "BC",
            "Helena Trus",
            "74.89",
            "0",
            "20",
            "20",
            "6"
        ],
        [
            "AG-3",
            "maksi",
            "Folt-Point-Pollach Bako",
            "Baki",
            "VIZ",
            "Helena Trus ",
            "102.29",
            "10.29",
            "10",
            "20.29",
            "7"
        ],
        [
            "AG-3",
            "maksi",
            "Born To Win From Amber Lat",
            "Winnie",
            "BC",
            "Svetlana Zolotnikova",
            "87.99",
            "2.65",
            "25",
            "27.65",
            "8"
        ],
        [
            "AG-3",
            "maksi",
            "Cheddarhill Berth Balthasar",
            "Robi",
            "WSS",
            "Tuuli Vaino",
            "103.61",
            "11.61",
            "20",
            "31.61",
            "9"
        ],
        [
            "AG-3",
            "maksi",
            "Dion's Wheaten Glenn",
            "Glenn",
            "IWT",
            "Tuuli Kauer",
            "122.49",
            "30.49",
            "20",
            "50.49",
            "10"
        ],
        [
            "AG-3",
            "maksi",
            "Bimbik's Carrie",
            "Carrie",
            "ISS",
            "Aet Leemet",
            "41.78",
            "0",
            "100",
            "100",
            "11"
        ],
        [
            "AG-3",
            "maksi",
            "Donna",
            "Donna",
            "MIX",
            "Birjo Nurmoja",
            "45.93",
            "2.93",
            "100",
            "102.93",
            "12"
        ],
        [
            "AG-3",
            "maksi",
            "Bogaloo's Uniq Temptation",
            "Uzzie",
            "ISS",
            "Indrek Tirmaste",
            "52.57",
            "3.57",
            "100",
            "103.57",
            "13"
        ],
        [
            "AG-3",
            "maksi",
            "Yuki",
            "Yuki",
            "MIX",
            "Saara Vällik",
            "38.93",
            "0",
            "105",
            "105",
            "14"
        ],
        [
            "AG-3",
            "maksi",
            "Frosty Forest Zeta Prime",
            "Süsi",
            "MAL",
            "Marje Piiroja",
            "33.05",
            "0",
            "110",
            "110",
            "15"
        ],
        [
            "AG-3",
            "maksi",
            "Crispin Castor de Ruwe Kempenaer",
            "Crispin",
            "HKK",
            "Monika Adamson",
            "40.13",
            "0",
            "110",
            "110",
            "16"
        ],
        [
            "AG-3",
            "maksi",
            "Argovian Irresistible Emotions",
            "Emmi",
            "OES",
            "Keida Tirmaste",
            "49",
            "0",
            "115",
            "115",
            "17"
        ],
        [
            "AG-3",
            "maksi",
            "Kiosan's Orion",
            "Uuri",
            "MAL",
            "Stefi Praakli",
            "49.3",
            "6.3",
            "110",
            "116.3",
            "18"
        ],
        [
            "AG-3",
            "maksi",
            "Mortimer",
            "Morti",
            "MIX",
            "Monika Põld",
            "57.19",
            "8.19",
            "110",
            "118.19",
            "19"
        ],
        [
            "AG-3",
            "maksi",
            "Sign of Constancy Olivia",
            "Oltsu",
            "IS",
            "Liina Kümnik",
            "64.27",
            "15.27",
            "110",
            "125.27",
            "20"
        ]
    ],
    [
        [
            ""
        ],
        [
            "Otsingu avalehele >>"
        ],
        [
            "Ürituste kalendri avalehele >>"
        ],
        [
            ""
        ]
    ]
]