[
    [
        [
            "Info katse kohta:"
        ],
        [
            "Katse:",
            "",
            "AG võistlus (Eesti meistrivõistlused, EKL punktiarvestuses)"
        ],
        [
            "Aeg:",
            "",
            "23.05.2009"
        ],
        [
            "Koht:",
            "",
            "Tallinn"
        ],
        [
            "Korraldaja:",
            "",
            "Eesti Kennelliidu Koolitust Koordineeriv Kogu (EKL-KKK)"
        ],
        [
            "Kohtunik:",
            "",
            "Ninnie Lindvall"
        ]
    ],
    [
        [
            ""
        ],
        [
            "Tulemused (18):"
        ],
        [
            "Tegemist on võistluse koondtulemustega, radade tulemused eraldi on nähtavad järgnevatel linkidel:\n       rada 1, rada 2."
        ]
    ],
    [
        [
            "Klass",
            "Koer",
            "Hüüdnimi",
            "Tõug",
            "Koerajuht",
            "Aeg",
            "Ajavead",
            "Vead",
            "Punktid",
            "Koht"
        ],
        [
            "AG-3",
            "mini",
            "Tsarodej Herlexi",
            "Lexi",
            "JRT",
            "Kristi Vaidla",
            "79.77",
            "2.4",
            "5",
            "7.4",
            "1"
        ],
        [
            "AG-3",
            "mini",
            "Karanest First Try Valve",
            "Vallu",
            "JRT",
            "Stefi Praakli",
            "82.54",
            "2.76",
            "10",
            "12.76",
            "2"
        ],
        [
            "AG-3",
            "mini",
            "Ansvel New Style",
            "Vitas",
            "MP",
            "Jelena Virro",
            "91.09",
            "11.09",
            "10",
            "21.09",
            "3"
        ],
        [
            "AG-3",
            "mini",
            "Helandros It's Magic",
            "Charly",
            "CKS",
            "Elika Lass",
            "33.06",
            "0",
            "100",
            "100",
            "4"
        ],
        [
            "AG-3",
            "mini",
            "Wonder Babe Of Happytails",
            "Lill",
            "WT",
            "Tiina Jürjo",
            "34.2",
            "0",
            "100",
            "100",
            "5"
        ],
        [
            "AG-3",
            "mini",
            "Brenoli Snap Shekatti",
            "Snäppi",
            "KP",
            "Ede Brand",
            "42.16",
            "0",
            "100",
            "100",
            "6"
        ],
        [
            "AG-3",
            "midi",
            "Catella Noel",
            "Fidel",
            "VP",
            "Eva-Liis Loogväli",
            "78.44",
            "3.22",
            "5",
            "8.22",
            "1"
        ],
        [
            "AG-3",
            "midi",
            "Volfrad Mari'Ana Sophie",
            "Sohvi",
            "IKS",
            "Inga Järv",
            "73.4",
            "0.6",
            "10",
            "10.6",
            "2"
        ],
        [
            "AG-3",
            "midi",
            "Ak Mil Vista Captain Cedric",
            "Sedrik",
            "WT",
            "Tiina Jürjo",
            "80.03",
            "0.75",
            "10",
            "10.75",
            "3"
        ],
        [
            "AG-3",
            "midi",
            "Nevskaja Zhemchuzhina Pikkolo",
            "Piko",
            "VP",
            "Liivika Pärg",
            "81.01",
            "6.3",
            "5",
            "11.3",
            "4"
        ],
        [
            "AG-3",
            "midi",
            "Mersu Joy Jewel",
            "Lota",
            "BT",
            "Katrina Rappu",
            "81.31",
            "2.41",
            "15",
            "17.41",
            "5"
        ],
        [
            "AG-3",
            "midi",
            "Avalanche Menuetas",
            "Axy",
            "VP",
            "Sirje Tammsalu",
            "88.26",
            "8.26",
            "10",
            "18.26",
            "6"
        ],
        [
            "AG-3",
            "maksi",
            "Woksebs Queen",
            "Queeny",
            "WLK",
            "Kalle Kaljus",
            "68.62",
            "0",
            "10",
            "10",
            "1"
        ],
        [
            "AG-3",
            "maksi",
            "Rusch Mix Rurik",
            "Rurik",
            "SP",
            "Sirje Tammsalu",
            "73.3",
            "0",
            "25",
            "25",
            "2"
        ],
        [
            "AG-3",
            "maksi",
            "Alfa Sagittarius Arej",
            "Rej",
            "BE",
            "Natalja Garastsenko",
            "34.59",
            "0",
            "100",
            "100",
            "3"
        ],
        [
            "AG-3",
            "maksi",
            "Eyewitness Pandemonium",
            "Dixi",
            "BC",
            "Anne Tammiksalu",
            "37.37",
            "0",
            "100",
            "100",
            "4"
        ],
        [
            "AG-3",
            "maksi",
            "Folt-Point-Pollach Bako",
            "Baki",
            "VIZ",
            "Helena Trus ",
            "40.89",
            "4.89",
            "100",
            "104.89",
            "5"
        ],
        [
            "AG-3",
            "maksi",
            "Tending Eagle-Eyed",
            "Rika",
            "BC",
            "Anne Tammiksalu",
            "0",
            "0",
            "200",
            "200",
            ""
        ]
    ],
    [
        [
            ""
        ],
        [
            "Otsingu avalehele >>"
        ],
        [
            "Ürituste kalendri avalehele >>"
        ],
        [
            ""
        ]
    ]
]