[
    [
        [
            "Info katse kohta:"
        ],
        [
            "Katse:",
            "",
            "AG võistlus (juunioride EMV, Eesti meistrivõistlused)"
        ],
        [
            "Aeg:",
            "",
            "15-16.06.2024"
        ],
        [
            "Koht:",
            "",
            "Valgamaa, Kääriku"
        ],
        [
            "Korraldaja:",
            "",
            "Eesti Agilityliit (AGLIIT)"
        ],
        [
            "Kohtunik:",
            "",
            "Neil Ellis"
        ]
    ],
    [
        [
            ""
        ],
        [
            "Tulemused (17):"
        ],
        [
            "Tegemist on võistluse koondtulemustega, radade tulemused eraldi on nähtavad järgnevatel linkidel:\n       rada 3, rada 4."
        ]
    ],
    [
        [
            "Klass",
            "Koer",
            "Hüüdnimi",
            "Tõug",
            "Koerajuht",
            "Aeg",
            "Ajavead",
            "Vead",
            "Punktid",
            "Koht"
        ],
        [
            "OPEN",
            "mini",
            "Elbar's Golden Whiskey",
            "Archie",
            "SHE",
            "Gerda Gužvina",
            "83.04",
            "0",
            "5",
            "5",
            "1"
        ],
        [
            "OPEN",
            "mini",
            "Ability Black Ocean",
            "Kratt",
            "SHE",
            "Greete Tammsalu",
            "83.63",
            "0",
            "5",
            "5",
            "2"
        ],
        [
            "OPEN",
            "mini",
            "E' Pomelo Black Choko",
            "Pomelo",
            "MIX",
            "Grettel Mirell Kutsar",
            "102.48",
            "0",
            "5",
            "5",
            "3"
        ],
        [
            "OPEN",
            "mini",
            "Helandros Ivory And Ebony",
            "Mona",
            "CKS",
            "Egor Suhhanov",
            "112.82",
            "7.28",
            "0",
            "7.28",
            "4"
        ],
        [
            "OPEN",
            "mini",
            "Zicere Agile Adamin",
            "Adamin",
            "SHE",
            "Taavi Vaino",
            "73.3",
            "0",
            "15",
            "15",
            "5"
        ],
        [
            "OPEN",
            "mini",
            "Tsvetok Frantsii Coco Chanel",
            "Shanja",
            "PAP",
            "Annaliisa Metsmägi",
            "51.04",
            "0",
            "100",
            "100",
            "6"
        ],
        [
            "OPEN",
            "mini",
            "Siimline's Pirate Princess",
            "Piiksu",
            "PAP",
            "Greete Tammsalu",
            "65.27",
            "12.27",
            "105",
            "117.27",
            "7"
        ],
        [
            "OPEN",
            "mini",
            "Time To Dream Sielos Draugas",
            "Dream",
            "SHE",
            "Kert Laht",
            "0",
            "0",
            "200",
            "200",
            ""
        ],
        [
            "OPEN",
            "mini",
            "Fanta Ekmada House",
            "Fay",
            "MP",
            "Grettel Mirell Kutsar",
            "0",
            "0",
            "200",
            "200",
            ""
        ],
        [
            "OPEN",
            "midi",
            "Cen Clarence's Black Tulip",
            "Zorro",
            "VP",
            "Lauriin Nõmmsalu",
            "84.3",
            "0",
            "0",
            "0",
            "1"
        ],
        [
            "OPEN",
            "midi",
            "Scandyline With Love",
            "Sky",
            "SHE",
            "Lisette Rohtla",
            "97.99",
            "0",
            "0",
            "0",
            "2"
        ],
        [
            "OPEN",
            "midi",
            "Caro",
            "Karo",
            "SHE",
            "Mia-Kärt Kaas",
            "79.99",
            "0",
            "15",
            "15",
            "3"
        ],
        [
            "OPEN",
            "midi",
            "Ability Black Omega",
            "Mega",
            "SHE",
            "Katariina Põder",
            "35.07",
            "0",
            "100",
            "100",
            "4"
        ],
        [
            "OPEN",
            "midi",
            "Legacy's Spot On Review",
            "Nyah",
            "AVL",
            "Erin Dunaway",
            "0",
            "0",
            "200",
            "200",
            ""
        ],
        [
            "OPEN",
            "midi",
            "Elbar's Golden Sunrise",
            "Sannu",
            "SHE",
            "Kert Laht",
            "0",
            "0",
            "200",
            "200",
            ""
        ],
        [
            "OPEN",
            "maksi",
            "Follow The Leader Mogwai Messi",
            "Messi",
            "BC",
            "Polina Morozova",
            "46.02",
            "0",
            "120",
            "120",
            "1"
        ],
        [
            "OPEN",
            "maksi",
            "Pyydyskartanon Billa Bong",
            "Billa",
            "TER",
            "Marta Kipper",
            "66.06",
            "7.06",
            "115",
            "122.06",
            "2"
        ]
    ],
    [
        [
            ""
        ],
        [
            "Otsingu avalehele >>"
        ],
        [
            "Ürituste kalendri avalehele >>"
        ],
        [
            ""
        ]
    ]
]