[
    [
        [
            "Info katse kohta:"
        ],
        [
            "Katse:",
            "",
            "AG võistlus, rada 1 (Eesti meistrivõistlused, EKL punktiarvestuses), järgmine rada"
        ],
        [
            "Aeg:",
            "",
            "26.06.2021"
        ],
        [
            "Koht:",
            "",
            "Valgamaa, Kääriku"
        ],
        [
            "Korraldaja:",
            "",
            "Eesti Kennelliidu Koolitust Koordineeriv Kogu (EKL-KKK)"
        ],
        [
            "Kohtunik:",
            "",
            "Petr Pupik"
        ],
        [
            "Ideaalaeg ja -kiirus:",
            "",
            "H-3: vmini: 51s (4.16m/s), mini: 51s (4.24m/s), midi: 51s (4.24m/s), vmaksi: 44s (4.41m/s), maksi: 45s (4.44m/s)"
        ],
        [
            "",
            "Lisainfo: EMV korraldab koostöös EKL-KKK-ga Koerteklubi Säde.\nOsalustasu: 25 eurot 2 rada. Eelmise aasta Eesti Meistrid saavad osaleda tasuta.\nOsaleda saavad EST registrisse kantud tõukoerad ja tõutud koerad.\nRegistreerimisperiood: 12.04-14.06.2021"
        ],
        [
            "Lisainfo: EMV korraldab koostöös EKL-KKK-ga Koerteklubi Säde.\nOsalustasu: 25 eurot 2 rada. Eelmise aasta Eesti Meistrid saavad osaleda tasuta.\nOsaleda saavad EST registrisse kantud tõukoerad ja tõutud koerad.\nRegistreerimisperiood: 12.04-14.06.2021"
        ],
        [
            "Lisainfo: EMV korraldab koostöös EKL-KKK-ga Koerteklubi Säde.\nOsalustasu: 25 eurot 2 rada. Eelmise aasta Eesti Meistrid saavad osaleda tasuta.\nOsaleda saavad EST registrisse kantud tõukoerad ja tõutud koerad.\nRegistreerimisperiood: 12.04-14.06.2021"
        ],
        []
    ],
    [
        [
            ""
        ],
        [
            "Tulemused (72):"
        ],
        [
            "Tegemist on koondarvestusega võistluse osaks oleva rajaga. Koondtulemused on nähtavad\n       siin."
        ]
    ],
    [
        [
            "Klass",
            "Koer",
            "Hüüdnimi",
            "Tõug",
            "Koerajuht",
            "Aeg",
            "Kiirus",
            "Ajavead",
            "Vead",
            "Punktid",
            "Hinne",
            "Tulemus",
            "Koht"
        ],
        [
            "H-3",
            "vmini",
            "Ambre Dore Chelsea",
            "Chelsy",
            "PAP",
            "Laura Karolina Gradickaite",
            "38.56",
            "5.50 ",
            "-12.44",
            "0",
            "0",
            "suurepärane",
            "H-3",
            "1"
        ],
        [
            "H-3",
            "vmini",
            "Bruno",
            "Beam",
            "JRT",
            "Andrei Gaidunko",
            "46.91",
            "4.52 ",
            "-4.09",
            "0",
            "0",
            "suurepärane",
            "H-3",
            "2"
        ],
        [
            "H-3",
            "vmini",
            "Siimline's How Do U Like Me Now",
            "Nupi",
            "MP",
            "Jane Tüksammel",
            "50.04",
            "4.24 ",
            "-0.96",
            "0",
            "0",
            "suurepärane",
            "H-3",
            "3"
        ],
        [
            "H-3",
            "vmini",
            "Lexberry's Snow Star Lore",
            "Lore",
            "JRT",
            "Kadi Kivi",
            "46.15",
            "4.59 ",
            "-4.85",
            "5",
            "5",
            "suurepärane",
            "H-3",
            "4"
        ],
        [
            "H-3",
            "vmini",
            "Millimeeter",
            "Milli",
            "MIX",
            "Annika Maripuu",
            "58.05",
            "3.65 ",
            "7.05",
            "0",
            "7.05",
            "väga hea",
            "H-3",
            "5"
        ],
        [
            "H-3",
            "vmini",
            "Lexberry's Winter Romance Ilze",
            "Ilze",
            "JRT",
            "Aimi Käsik",
            "43.82",
            "4.84 ",
            "-7.18",
            "10",
            "10",
            "väga hea",
            "H-3",
            "6"
        ],
        [
            "H-3",
            "vmini",
            "Lexberry's Snow Star Love",
            "Love",
            "JRT",
            "Liidia Ilves",
            "46.23",
            "4.59 ",
            "-4.77",
            "10",
            "10",
            "väga hea",
            "H-3",
            "7"
        ],
        [
            "H-3",
            "vmini",
            "Tsvetok Frantsii Coco Chanel",
            "Shanja",
            "PAP",
            "Karen Dunaway",
            "47.15",
            "4.50 ",
            "-3.85",
            "10",
            "10",
            "väga hea",
            "H-3",
            "8"
        ],
        [
            "H-3",
            "vmini",
            "Siimline's Miss Love Legacy",
            "Lizzy",
            "LHA",
            "Annika Maripuu",
            "61.86",
            "3.43 ",
            "10.86",
            "0",
            "10.86",
            "väga hea",
            "H-3",
            "9"
        ],
        [
            "H-3",
            "vmini",
            "Berkelia An Fire Rock Vom Elbrubin",
            "Berke",
            "PAP",
            "Mariann Rebane",
            "",
            "",
            "",
            "",
            "",
            "diskval.",
            "",
            ""
        ],
        [
            "H-3",
            "mini",
            "Follow The Leader Frisky Blizzard",
            "Freya",
            "PRT",
            "Jelena Marzaljuk",
            "39.17",
            "5.51 ",
            "-11.83",
            "0",
            "0",
            "suurepärane",
            "H-3",
            "1"
        ],
        [
            "H-3",
            "mini",
            "Scandyline Ocean Of Love",
            "Davis",
            "SHE",
            "Dmitri Kargin",
            "42.34",
            "5.10 ",
            "-8.66",
            "0",
            "0",
            "suurepärane",
            "H-3",
            "2"
        ],
        [
            "H-3",
            "mini",
            "Fire Rock Dandelion",
            "Mirka",
            "MP",
            "Liivika Pärg",
            "42.58",
            "5.07 ",
            "-8.42",
            "0",
            "0",
            "suurepärane",
            "H-3",
            "3"
        ],
        [
            "H-3",
            "mini",
            "Danaini Baron de Nantes",
            "Nante",
            "PAP",
            "Kamilla Alma Vilderson",
            "42.6",
            "5.07 ",
            "-8.4",
            "0",
            "0",
            "suurepärane",
            "H-3",
            "4"
        ],
        [
            "H-3",
            "mini",
            "Aucanada Adrenaline Boost",
            "Kiss",
            "SHE",
            "Marje Piiroja",
            "44.34",
            "4.87 ",
            "-6.66",
            "0",
            "0",
            "suurepärane",
            "H-3",
            "5"
        ],
        [
            "H-3",
            "mini",
            "As'gunapal Be Happy Spring Flower",
            "Pähkel",
            "BT",
            "Maarja Padari-Kallit",
            "45.18",
            "4.78 ",
            "-5.82",
            "0",
            "0",
            "suurepärane",
            "H-3",
            "6"
        ],
        [
            "H-3",
            "mini",
            "Fire Rock Dioreen",
            "Deena",
            "MP",
            "Külli Maleva",
            "48.51",
            "4.45 ",
            "-2.49",
            "0",
            "0",
            "suurepärane",
            "H-3",
            "7"
        ],
        [
            "H-3",
            "mini",
            "Hermes Juros Šypsenele",
            "Piksel",
            "KP",
            "Genno Aug",
            "51.5",
            "4.19 ",
            "0.5",
            "0",
            "0.5",
            "suurepärane",
            "H-3",
            "8"
        ],
        [
            "H-3",
            "mini",
            "Sweet Cake From Sielos Draugas",
            "Jay",
            "SHE",
            "Marta Miil",
            "39.78",
            "5.43 ",
            "-11.22",
            "5",
            "5",
            "suurepärane",
            "H-3",
            "9"
        ],
        [
            "H-3",
            "mini",
            "Siimline's Mickey",
            "Mickey",
            "PAP",
            "Kätriin Kivimets",
            "40.89",
            "5.28 ",
            "-10.11",
            "5",
            "5",
            "suurepärane",
            "H-3",
            "10"
        ],
        [
            "H-3",
            "mini",
            "Flyland Swift Thumbelina",
            "Chika",
            "SHE",
            "Ede Brand",
            "45.87",
            "4.71 ",
            "-5.13",
            "5",
            "5",
            "suurepärane",
            "H-3",
            "11"
        ],
        [
            "H-3",
            "mini",
            "Millgret Reya",
            "Roxy",
            "KP",
            "Triine Piirsalu",
            "42.08",
            "5.13 ",
            "-8.92",
            "10",
            "10",
            "väga hea",
            "H-3",
            "12"
        ],
        [
            "H-3",
            "mini",
            "Brie One In A Million",
            "Jackie",
            "MIX",
            "Piret Pärl",
            "46.58",
            "4.64 ",
            "-4.42",
            "10",
            "10",
            "väga hea",
            "H-3",
            "13"
        ],
        [
            "H-3",
            "mini",
            "Scarlett Bevy Jr Johnny Torrio",
            "Johnny",
            "JRT",
            "Jaanus Rand",
            "56.11",
            "3.85 ",
            "5.11",
            "5",
            "10.11",
            "väga hea",
            "H-3",
            "14"
        ],
        [
            "H-3",
            "mini",
            "Scarlett Bevy Jr Secret Hope",
            "Jessi",
            "JRT",
            "Ene Rand",
            "56.75",
            "3.81 ",
            "5.75",
            "5",
            "10.75",
            "väga hea",
            "H-3",
            "15"
        ],
        [
            "H-3",
            "mini",
            "Flyland Jaunty Fellow",
            "Redži",
            "SHE",
            "Kristina Lukašejeva",
            "54.63",
            "3.95 ",
            "3.63",
            "10",
            "13.63",
            "väga hea",
            "H-3",
            "16"
        ],
        [
            "H-3",
            "mini",
            "Karvahaalarin Padme",
            "Γ (Gamma)",
            "PRT",
            "Hetty Nõmmann",
            "",
            "",
            "",
            "",
            "",
            "diskval.",
            "",
            ""
        ],
        [
            "H-3",
            "mini",
            "Flyland Wildly Vital",
            "My",
            "SHE",
            "Keida Raamat",
            "",
            "",
            "",
            "",
            "",
            "diskval.",
            "",
            ""
        ],
        [
            "H-3",
            "midi",
            "Wandapesa Coconut Zehra Zareen",
            "Zira",
            "SHE",
            "Kaisa Tsäro",
            "36.13",
            "5.98 ",
            "-14.87",
            "0",
            "0",
            "suurepärane",
            "H-3",
            "1"
        ],
        [
            "H-3",
            "midi",
            "Irhaberki Ronja",
            "Ronja",
            "MUD",
            "Elen Kivi-Paju",
            "36.47",
            "5.92 ",
            "-14.53",
            "0",
            "0",
            "suurepärane",
            "H-3",
            "2"
        ],
        [
            "H-3",
            "midi",
            "Elbar's Black Joconde",
            "Lizzi",
            "SHE",
            "Kaisa Tsäro",
            "38.08",
            "5.67 ",
            "-12.92",
            "0",
            "0",
            "suurepärane",
            "H-3",
            "3"
        ],
        [
            "H-3",
            "midi",
            "Party Nonstop Estelle",
            "Essie",
            "PRT",
            "Natali Happonen",
            "38.66",
            "5.59 ",
            "-12.34",
            "0",
            "0",
            "suurepärane",
            "H-3",
            "4"
        ],
        [
            "H-3",
            "midi",
            "Vanille de La Vallee Du Mouton",
            "Vanie",
            "PÜR",
            "Piret Kannike",
            "39.74",
            "5.44 ",
            "-11.26",
            "0",
            "0",
            "suurepärane",
            "H-3",
            "5"
        ],
        [
            "H-3",
            "midi",
            "Lizzira's Athletic Zafirah",
            "Zemi",
            "SHE",
            "Kaisa Tsäro",
            "40.11",
            "5.39 ",
            "-10.89",
            "0",
            "0",
            "suurepärane",
            "H-3",
            "6"
        ],
        [
            "H-3",
            "midi",
            "Wandapesa Pina Colada Zinnia Zelda",
            "Zinni",
            "SHE",
            "Tuuli Vaino",
            "41.36",
            "5.22 ",
            "-9.64",
            "0",
            "0",
            "suurepärane",
            "H-3",
            "7"
        ],
        [
            "H-3",
            "midi",
            "Scandyline Elegant Gentleman",
            "Seva",
            "SHE",
            "Jelena Virro",
            "43.08",
            "5.01 ",
            "-7.92",
            "0",
            "0",
            "suurepärane",
            "H-3",
            "8"
        ],
        [
            "H-3",
            "midi",
            "Silvery Blu Funny Boy",
            "Funny",
            "SHE",
            "Meiri Soon",
            "38.98",
            "5.54 ",
            "-12.02",
            "5",
            "5",
            "suurepärane",
            "H-3",
            "9"
        ],
        [
            "H-3",
            "midi",
            "Caro",
            "Karo",
            "SHE",
            "Mia-Kärt Kaas",
            "45.58",
            "4.74 ",
            "-5.42",
            "5",
            "5",
            "suurepärane",
            "H-3",
            "10"
        ],
        [
            "H-3",
            "midi",
            "Chanson D'Ete Barracuda",
            "Pipa",
            "VP",
            "Jane Tüksammel",
            "49.87",
            "4.33 ",
            "-1.13",
            "5",
            "5",
            "suurepärane",
            "H-3",
            "11"
        ],
        [
            "H-3",
            "midi",
            "Nice Of You To Come Bye Into The Dark",
            "Reti",
            "HOR",
            "Inge Ringmets",
            "34.46",
            "6.27 ",
            "-16.54",
            "15",
            "15",
            "väga hea",
            "H-3",
            "12"
        ],
        [
            "H-3",
            "midi",
            "Azzure Gates Of Heaven",
            "Mürru",
            "MUD",
            "Toomas Pent",
            "",
            "",
            "",
            "",
            "",
            "diskval.",
            "",
            ""
        ],
        [
            "H-3",
            "midi",
            "Puszta's Legacy Altariel",
            "Nèra",
            "MUD",
            "Külliki Vain",
            "",
            "",
            "",
            "",
            "",
            "diskval.",
            "",
            ""
        ],
        [
            "H-3",
            "midi",
            "Skovfarmen's Black Peek A Boo",
            "Nali",
            "KEL",
            "Inessa Zaitseva",
            "",
            "",
            "",
            "",
            "",
            "diskval.",
            "",
            ""
        ],
        [
            "H-3",
            "midi",
            "Köves-Berci Betyar Fürge",
            "Fürge",
            "MUD",
            "Anastassia Tamm",
            "",
            "",
            "",
            "",
            "",
            "diskval.",
            "",
            ""
        ],
        [
            "H-3",
            "midi",
            "Frida",
            "Fi",
            "JRT",
            "Cathy Laiva",
            "",
            "",
            "",
            "",
            "",
            "diskval.",
            "",
            ""
        ],
        [
            "H-3",
            "vmaksi",
            "Rhosyn von Grünen Kuckuck",
            "Dora",
            "BC",
            "Keida Raamat",
            "31.59",
            "6.14 ",
            "-12.41",
            "0",
            "0",
            "suurepärane",
            "H-3",
            "1"
        ],
        [
            "H-3",
            "vmaksi",
            "Enzo Hendl",
            "Enzo",
            "BC",
            "Natalja Garastsenko",
            "31.88",
            "6.09 ",
            "-12.12",
            "0",
            "0",
            "suurepärane",
            "H-3",
            "2"
        ],
        [
            "H-3",
            "vmaksi",
            "Aimy Great Joy",
            "Piper",
            "CHO",
            "Merit Rahnik",
            "38.4",
            "5.05 ",
            "-5.6",
            "0",
            "0",
            "suurepärane",
            "H-3",
            "3"
        ],
        [
            "H-3",
            "vmaksi",
            "Piggyland's Up To Speed Dollie",
            "Gitta",
            "BC",
            "Ege Taliaru",
            "32.52",
            "5.97 ",
            "-11.48",
            "10",
            "10",
            "väga hea",
            "H-3",
            "4"
        ],
        [
            "H-3",
            "vmaksi",
            "Glaginye Kynuna",
            "Nullah",
            "KEL",
            "Tiina Kurs",
            "39.94",
            "4.86 ",
            "-4.06",
            "10",
            "10",
            "väga hea",
            "H-3",
            "5"
        ],
        [
            "H-3",
            "vmaksi",
            "Toberoi Birch",
            "Piki",
            "BC",
            "Kaisa Tamm",
            "31.95",
            "6.07 ",
            "-12.05",
            "15",
            "15",
            "väga hea",
            "H-3",
            "6"
        ],
        [
            "H-3",
            "vmaksi",
            "Fire Rock Edha",
            "Edha",
            "BC",
            "Saara Vällik",
            "38.32",
            "5.06 ",
            "-5.68",
            "15",
            "15",
            "väga hea",
            "H-3",
            "7"
        ],
        [
            "H-3",
            "vmaksi",
            "Breuddwyd Firesoul Princess",
            "Freya",
            "WSS",
            "Kati Elvelt",
            "51.24",
            "3.79 ",
            "7.24",
            "15",
            "22.24",
            "hea",
            "H-3",
            "8"
        ],
        [
            "H-3",
            "vmaksi",
            "Orome Du Mourioche",
            "O",
            "PÜP",
            "Tiina Teng-Tamme",
            "",
            "",
            "",
            "",
            "",
            "diskval.",
            "",
            ""
        ],
        [
            "H-3",
            "vmaksi",
            "Piggyland's You Know My Name",
            "Killu",
            "BC",
            "Ülli Saar",
            "",
            "",
            "",
            "",
            "",
            "diskval.",
            "",
            ""
        ],
        [
            "H-3",
            "maksi",
            "Proforza Magnificent",
            "Fay",
            "BC",
            "Marge Mitt",
            "33.89",
            "5.90 ",
            "-11.11",
            "0",
            "0",
            "suurepärane",
            "H-3",
            "1"
        ],
        [
            "H-3",
            "maksi",
            "Daydream",
            "Riin",
            "MAL",
            "Reet Volt",
            "34.34",
            "5.82 ",
            "-10.66",
            "0",
            "0",
            "suurepärane",
            "H-3",
            "2"
        ],
        [
            "H-3",
            "maksi",
            "Cordelia",
            "Corry",
            "BC",
            "Reet Sai",
            "36.06",
            "5.55 ",
            "-8.94",
            "0",
            "0",
            "suurepärane",
            "H-3",
            "3"
        ],
        [
            "H-3",
            "maksi",
            "Pamparix Golden Fay",
            "Lotta",
            "CPK",
            "Kaisa Karjus",
            "39.5",
            "5.06 ",
            "-5.5",
            "0",
            "0",
            "suurepärane",
            "H-3",
            "4"
        ],
        [
            "H-3",
            "maksi",
            "Billy",
            "Billy",
            "MIX",
            "Merika Laid",
            "48",
            "4.17 ",
            "3",
            "0",
            "3",
            "suurepärane",
            "H-3",
            "5"
        ],
        [
            "H-3",
            "maksi",
            "Fire Rock Erk",
            "Erk",
            "BC",
            "Marko Visse",
            "34.93",
            "5.73 ",
            "-10.07",
            "5",
            "5",
            "suurepärane",
            "H-3",
            "6"
        ],
        [
            "H-3",
            "maksi",
            "Harmony Hope Alias Dakota",
            "Lisa",
            "GRO",
            "Natalja Arhipova",
            "53.15",
            "3.76 ",
            "8.15",
            "0",
            "8.15",
            "väga hea",
            "H-3",
            "7"
        ],
        [
            "H-3",
            "maksi",
            "Born To Win Warrior Danger",
            "Danger",
            "VLK",
            "Mari Mangusson",
            "38.23",
            "5.23 ",
            "-6.77",
            "10",
            "10",
            "väga hea",
            "H-3",
            "8"
        ],
        [
            "H-3",
            "maksi",
            "Gaba Glamorous Olbramovicky Kvitek",
            "Glämm",
            "MAL",
            "Jaanika Lillenberg",
            "33.81",
            "5.92 ",
            "-11.19",
            "15",
            "15",
            "väga hea",
            "H-3",
            "9"
        ],
        [
            "H-3",
            "maksi",
            "Momento Mistika Sailing To Peak River",
            "Kätu",
            "ALK",
            "Annika Maripuu",
            "38.83",
            "5.15 ",
            "-6.17",
            "15",
            "15",
            "väga hea",
            "H-3",
            "10"
        ],
        [
            "H-3",
            "maksi",
            "Capricole Crazy About You",
            "Olli",
            "ALK",
            "Tuuli Vaino",
            "51",
            "3.92 ",
            "6",
            "20",
            "26",
            "",
            "H-3",
            "11"
        ],
        [
            "H-3",
            "maksi",
            "Follow The Leader Ace Of Trumps",
            "Tezzi",
            "BC",
            "Aleksandr Drozdov",
            "",
            "",
            "",
            "",
            "",
            "diskval.",
            "",
            ""
        ],
        [
            "H-3",
            "maksi",
            "Fire Rock Ginger",
            "Sass",
            "BC",
            "Tiina Jürjo",
            "",
            "",
            "",
            "",
            "",
            "diskval.",
            "",
            ""
        ],
        [
            "H-3",
            "maksi",
            "Fire Rock Inspire",
            "Nete",
            "BC",
            "Triin Jaaniste",
            "",
            "",
            "",
            "",
            "",
            "diskval.",
            "",
            ""
        ],
        [
            "H-3",
            "maksi",
            "Follow The Leader Queen Of Hearts",
            "Uma",
            "BC",
            "Natalja Garastsenko",
            "",
            "",
            "",
            "",
            "",
            "diskval.",
            "",
            ""
        ],
        [
            "H-3",
            "maksi",
            "Never Never Land L'vana",
            "Mõsh",
            "BC",
            "Olga Uleksina",
            "",
            "",
            "",
            "",
            "",
            "diskval.",
            "",
            ""
        ],
        [
            "H-3",
            "maksi",
            "Midnight Breeze Ausyte",
            "Micky",
            "ALK",
            "Iris Paarop",
            "",
            "",
            "",
            "",
            "",
            "diskval.",
            "",
            ""
        ]
    ],
    [
        [
            ""
        ],
        [
            "Otsingu avalehele >>"
        ],
        [
            "Ürituste kalendri avalehele >>"
        ],
        [
            ""
        ]
    ]
]