[
    [
        [
            "Info katse kohta:"
        ],
        [
            "Katse:",
            "",
            "AG võistlus, rada 3 (juunioride EMV, Eesti meistrivõistlused), eelmine rada, järgmine rada"
        ],
        [
            "Aeg:",
            "",
            "15-16.06.2024"
        ],
        [
            "Koht:",
            "",
            "Valgamaa, Kääriku"
        ],
        [
            "Korraldaja:",
            "",
            "Eesti Agilityliit (AGLIIT)"
        ],
        [
            "Kohtunik:",
            "",
            "Neil Ellis"
        ],
        [
            "Ideaalaeg ja -kiirus:",
            "",
            "H OPEN: vmini: 53s (3.66m/s), mini: 50s (3.88m/s), midi: 50s (3.88m/s), maksi: 48s (4.04m/s)"
        ]
    ],
    [
        [
            ""
        ],
        [
            "Tulemused (17):"
        ],
        [
            "Tegemist on koondarvestusega võistluse osaks oleva rajaga. Koondtulemused on nähtavad\n       siin."
        ]
    ],
    [
        [
            "Klass",
            "Koer",
            "Hüüdnimi",
            "Tõug",
            "Koerajuht",
            "Aeg",
            "Kiirus",
            "Ajavead",
            "Vead",
            "Punktid",
            "Hinne",
            "Tulemus",
            "Koht"
        ],
        [
            "H OPEN",
            "vmini",
            "E' Pomelo Black Choko",
            "Pomelo",
            "MIX",
            "Grettel Mirell Kutsar",
            "46.57",
            "4.17",
            "-6.43",
            "5",
            "5",
            "suurepärane",
            "H OPEN",
            "1"
        ],
        [
            "H OPEN",
            "vmini",
            "Siimline's Pirate Princess",
            "Piiksu",
            "PAP",
            "Greete Tammsalu",
            "65.27",
            "2.97",
            "12.27",
            "5",
            "17.27",
            "hea",
            "H OPEN",
            "2"
        ],
        [
            "H OPEN",
            "vmini",
            "Tsvetok Frantsii Coco Chanel",
            "Shanja",
            "PAP",
            "Annaliisa Metsmägi",
            "",
            "",
            "",
            "",
            "",
            "diskval.",
            "",
            ""
        ],
        [
            "H OPEN",
            "mini",
            "Elbar's Golden Whiskey",
            "Archie",
            "SHE",
            "Gerda Gužvina",
            "33.05",
            "5.87",
            "-16.95",
            "0",
            "0",
            "suurepärane",
            "H OPEN",
            "1"
        ],
        [
            "H OPEN",
            "mini",
            "Zicere Agile Adamin",
            "Adamin",
            "SHE",
            "Taavi Vaino",
            "33.41",
            "5.81",
            "-16.59",
            "0",
            "0",
            "suurepärane",
            "H OPEN",
            "2"
        ],
        [
            "H OPEN",
            "mini",
            "Helandros Ivory And Ebony",
            "Mona",
            "CKS",
            "Egor Suhhanov",
            "46.54",
            "4.17",
            "-3.46",
            "0",
            "0",
            "suurepärane",
            "H OPEN",
            "3"
        ],
        [
            "H OPEN",
            "mini",
            "Ability Black Ocean",
            "Kratt",
            "SHE",
            "Greete Tammsalu",
            "38.28",
            "5.07",
            "-11.72",
            "5",
            "5",
            "suurepärane",
            "H OPEN",
            "4"
        ],
        [
            "H OPEN",
            "mini",
            "Fanta Ekmada House",
            "Fay",
            "MP",
            "Grettel Mirell Kutsar",
            "",
            "",
            "",
            "",
            "",
            "diskval.",
            "",
            ""
        ],
        [
            "H OPEN",
            "mini",
            "Time To Dream Sielos Draugas",
            "Dream",
            "SHE",
            "Kert Laht",
            "",
            "",
            "",
            "",
            "",
            "diskval.",
            "",
            ""
        ],
        [
            "H OPEN",
            "midi",
            "Caro",
            "Karo",
            "SHE",
            "Mia-Kärt Kaas",
            "34.21",
            "5.67",
            "-15.79",
            "0",
            "0",
            "suurepärane",
            "H OPEN",
            "1"
        ],
        [
            "H OPEN",
            "midi",
            "Ability Black Omega",
            "Mega",
            "SHE",
            "Katariina Põder",
            "35.07",
            "5.53",
            "-14.93",
            "0",
            "0",
            "suurepärane",
            "H OPEN",
            "2"
        ],
        [
            "H OPEN",
            "midi",
            "Cen Clarence's Black Tulip",
            "Zorro",
            "VP",
            "Lauriin Nõmmsalu",
            "37.86",
            "5.12",
            "-12.14",
            "0",
            "0",
            "suurepärane",
            "H OPEN",
            "3"
        ],
        [
            "H OPEN",
            "midi",
            "Scandyline With Love",
            "Sky",
            "SHE",
            "Lisette Rohtla",
            "46.77",
            "4.15",
            "-3.23",
            "0",
            "0",
            "suurepärane",
            "H OPEN",
            "4"
        ],
        [
            "H OPEN",
            "midi",
            "Elbar's Golden Sunrise",
            "Sannu",
            "SHE",
            "Kert Laht",
            "",
            "",
            "",
            "",
            "",
            "diskval.",
            "",
            ""
        ],
        [
            "H OPEN",
            "midi",
            "Legacy's Spot On Review",
            "Nyah",
            "AVL",
            "Erin Dunaway",
            "",
            "",
            "",
            "",
            "",
            "diskval.",
            "",
            ""
        ],
        [
            "H OPEN",
            "maksi",
            "Pyydyskartanon Billa Bong",
            "Billa",
            "TER",
            "Marta Kipper",
            "",
            "",
            "",
            "",
            "",
            "diskval.",
            "",
            ""
        ],
        [
            "H OPEN",
            "maksi",
            "Follow The Leader Mogwai Messi",
            "Messi",
            "BC",
            "Polina Morozova",
            "",
            "",
            "",
            "",
            "",
            "diskval.",
            "",
            ""
        ]
    ],
    [
        [
            ""
        ],
        [
            "Otsingu avalehele >>"
        ],
        [
            "Ürituste kalendri avalehele >>"
        ],
        [
            ""
        ]
    ]
]