[
    [
        [
            "Info katse kohta:"
        ],
        [
            "Katse:",
            "",
            "AG võistlus, rada 1 (Eesti meistrivõistlused, EKL punktiarvestuses), järgmine rada"
        ],
        [
            "Aeg:",
            "",
            "04.08.2012"
        ],
        [
            "Koht:",
            "",
            "Pärnumaa"
        ],
        [
            "Korraldaja:",
            "",
            "Eesti Kennelliidu Koolitust Koordineeriv Kogu (EKL-KKK)"
        ],
        [
            "Kohtunik:",
            "",
            "Johanna Nyberg"
        ],
        [
            "Ideaalaeg ja -kiirus:",
            "",
            "AG-3: 49s (3.51m/s)"
        ],
        [
            "",
            "Lisainfo: Võistlus korraldatakse koostöös Pärnu Piirkondliku Koerakasvatajate Klubiga"
        ],
        [
            "Lisainfo: Võistlus korraldatakse koostöös Pärnu Piirkondliku Koerakasvatajate Klubiga"
        ],
        [
            "Lisainfo: Võistlus korraldatakse koostöös Pärnu Piirkondliku Koerakasvatajate Klubiga"
        ],
        []
    ],
    [
        [
            ""
        ],
        [
            "Tulemused (47):"
        ],
        [
            "Tegemist on koondarvestusega võistluse osaks oleva rajaga. Koondtulemused on nähtavad\n       siin."
        ]
    ],
    [
        [
            "Klass",
            "Koer",
            "Hüüdnimi",
            "Tõug",
            "Koerajuht",
            "Aeg",
            "Kiirus",
            "Ajavead",
            "Vead",
            "Punktid",
            "Hinne",
            "Tulemus",
            "Koht"
        ],
        [
            "AG-3",
            "mini",
            "Elbar's Golden Dominik",
            "Stenley",
            "SHE",
            "Dmitri Kargin",
            "40.24",
            "4.27",
            "-8.76",
            "0",
            "0",
            "suurepärane",
            "AG-3",
            "1"
        ],
        [
            "AG-3",
            "mini",
            "Helandros Key To My Heart",
            "Phoebe",
            "CKS",
            "Piret Reinsalu",
            "44.68",
            "3.85",
            "-4.32",
            "0",
            "0",
            "suurepärane",
            "AG-3",
            "2"
        ],
        [
            "AG-3",
            "mini",
            "Metunai Relly",
            "Relly",
            "MP",
            "Stefi Praakli",
            "45.04",
            "3.82",
            "-3.96",
            "0",
            "0",
            "suurepärane",
            "AG-3",
            "3"
        ],
        [
            "AG-3",
            "mini",
            "Helandros It's Magic",
            "Charly",
            "CKS",
            "Elika Salonen",
            "45.16",
            "3.81",
            "-3.84",
            "0",
            "0",
            "suurepärane",
            "AG-3",
            "4"
        ],
        [
            "AG-3",
            "mini",
            "Millgret Fantastic Feeling",
            "Willi",
            "KP",
            "Ede Brand",
            "45.94",
            "3.74",
            "-3.06",
            "0",
            "0",
            "suurepärane",
            "AG-3",
            "5"
        ],
        [
            "AG-3",
            "mini",
            "Royal Fantasy French Rose",
            "Liisu",
            "CKS",
            "Jana Kima",
            "50.66",
            "3.40",
            "1.66",
            "0",
            "1.66",
            "suurepärane",
            "AG-3",
            "6"
        ],
        [
            "AG-3",
            "mini",
            "Kribu-Krabu Pässu-Nässu",
            "Kribu",
            "MIX",
            "Jane Tüksammel",
            "50.67",
            "3.39",
            "1.67",
            "0",
            "1.67",
            "suurepärane",
            "AG-3",
            "7"
        ],
        [
            "AG-3",
            "mini",
            "Jasper",
            "Jasper",
            "MIX",
            "Maria Teng",
            "51.29",
            "3.35",
            "2.29",
            "0",
            "2.29",
            "suurepärane",
            "AG-3",
            "8"
        ],
        [
            "AG-3",
            "mini",
            "Royal Fantasy Femme Fatale",
            "Femmie",
            "CKS",
            "Maarja Haljasmäe",
            "53.31",
            "3.23",
            "4.31",
            "0",
            "4.31",
            "suurepärane",
            "AG-3",
            "9"
        ],
        [
            "AG-3",
            "mini",
            "Fire Rock Bree",
            "Bree",
            "PAP",
            "Mariann Rebane",
            "46.12",
            "3.73",
            "-2.88",
            "5",
            "5",
            "suurepärane",
            "AG-3",
            "10"
        ],
        [
            "AG-3",
            "mini",
            "Viking",
            "Viking",
            "JRT",
            "Natalja Sazonova",
            "48.45",
            "3.55",
            "-0.55",
            "5",
            "5",
            "suurepärane",
            "AG-3",
            "11"
        ],
        [
            "AG-3",
            "mini",
            "Käpylä Mosku",
            "Muki",
            "SKS",
            "Külli Ragel",
            "55.85",
            "3.08",
            "6.85",
            "20",
            "26.85",
            "",
            "AG-3",
            "12"
        ],
        [
            "AG-3",
            "mini",
            "Pudik",
            "Pudik",
            "MIX",
            "Jelena Virro",
            "70.12",
            "2.45",
            "21.12",
            "15",
            "36.12",
            "",
            "AG-3",
            "13"
        ],
        [
            "AG-3",
            "mini",
            "Volfrad Saga's Ode To Sehkmeth",
            "Runa",
            "VBG",
            "Jelena Marzaljuk",
            "",
            "",
            "",
            "",
            "",
            "diskval.",
            "",
            ""
        ],
        [
            "AG-3",
            "mini",
            "Siimline's How Do U Like Me Now",
            "Nupi",
            "MP",
            "Jane Tüksammel",
            "",
            "",
            "",
            "",
            "",
            "diskval.",
            "",
            ""
        ],
        [
            "AG-3",
            "mini",
            "Wonder Babe Of Happytails",
            "Lill",
            "WT",
            "Tiina Jürjo",
            "",
            "",
            "",
            "",
            "",
            "diskval.",
            "",
            ""
        ],
        [
            "AG-3",
            "mini",
            "Just Patrick van Statum",
            "Pätrik",
            "JRT",
            "Epp Keevallik",
            "",
            "",
            "",
            "",
            "",
            "diskval.",
            "",
            ""
        ],
        [
            "AG-3",
            "midi",
            "Nevskaja Zhemchuzhina Pikkolo",
            "Piko",
            "VP",
            "Liivika Pärg",
            "43.31",
            "3.97",
            "-5.69",
            "0",
            "0",
            "suurepärane",
            "AG-3",
            "1"
        ],
        [
            "AG-3",
            "midi",
            "Soft And Furry Kamilla",
            "Tika",
            "GHT",
            "Natalja Garastsenko",
            "43.57",
            "3.95",
            "-5.43",
            "0",
            "0",
            "suurepärane",
            "AG-3",
            "2"
        ],
        [
            "AG-3",
            "midi",
            "Catella Noel",
            "Fidel",
            "VP",
            "Eva-Liis Loogväli",
            "44.11",
            "3.90",
            "-4.89",
            "0",
            "0",
            "suurepärane",
            "AG-3",
            "3"
        ],
        [
            "AG-3",
            "midi",
            "Spotty",
            "Lotta",
            "BGL",
            "Indrek Katushin",
            "49",
            "3.51",
            "0",
            "0",
            "0",
            "suurepärane",
            "AG-3",
            "4"
        ],
        [
            "AG-3",
            "midi",
            "Mooncraft's As You Like",
            "Thor",
            "SBT",
            "Jelena Marzaljuk",
            "50.57",
            "3.40",
            "1.57",
            "5",
            "6.57",
            "väga hea",
            "AG-3",
            "5"
        ],
        [
            "AG-3",
            "midi",
            "Ak Mil Vista Captain Cedric",
            "Sedrik",
            "WT",
            "Tiina Jürjo",
            "51.61",
            "3.33",
            "2.61",
            "5",
            "7.61",
            "väga hea",
            "AG-3",
            "6"
        ],
        [
            "AG-3",
            "midi",
            "Dalylove Exclusive Essense",
            "Bibi",
            "MAT",
            "Aleksander Andre",
            "45.55",
            "3.78",
            "-3.45",
            "10",
            "10",
            "väga hea",
            "AG-3",
            "7"
        ],
        [
            "AG-3",
            "midi",
            "Mileedi",
            "Liisu",
            "AKS",
            "Ene Kaldoja",
            "62.83",
            "2.74",
            "13.83",
            "5",
            "18.83",
            "hea",
            "AG-3",
            "8"
        ],
        [
            "AG-3",
            "midi",
            "Excellent Choice The Power Of Three",
            "Džoker",
            "SHE",
            "Kristina Lukašejeva",
            "",
            "",
            "",
            "",
            "",
            "diskval.",
            "",
            ""
        ],
        [
            "AG-3",
            "midi",
            "Falaris Favourite",
            "Figo",
            "SBT",
            "Imbi Soa",
            "",
            "",
            "",
            "",
            "",
            "diskval.",
            "",
            ""
        ],
        [
            "AG-3",
            "maksi",
            "Maeglin Hurricane",
            "Bolt",
            "BC",
            "Natalja Garastsenko",
            "37.56",
            "4.58",
            "-11.44",
            "0",
            "0",
            "suurepärane",
            "AG-3",
            "1"
        ],
        [
            "AG-3",
            "maksi",
            "Bogaloo's Uniq Temptation",
            "Uzzie",
            "ISS",
            "Indrek Tirmaste",
            "52.57",
            "3.27",
            "3.57",
            "0",
            "3.57",
            "suurepärane",
            "AG-3",
            "2"
        ],
        [
            "AG-3",
            "maksi",
            "Tending Eagle-Eyed",
            "Rika",
            "BC",
            "Anne Tammiksalu",
            "42.94",
            "4.01",
            "-6.06",
            "5",
            "5",
            "suurepärane",
            "AG-3",
            "3"
        ],
        [
            "AG-3",
            "maksi",
            "Bonvivant Yvre",
            "Lili",
            "MAL",
            "Tiia Jatsa",
            "44.56",
            "3.86",
            "-4.44",
            "5",
            "5",
            "suurepärane",
            "AG-3",
            "4"
        ],
        [
            "AG-3",
            "maksi",
            "Amazing Grace of Shamrock Field",
            "Roxy",
            "BC",
            "Helena Trus",
            "41.19",
            "4.18",
            "-7.81",
            "10",
            "10",
            "väga hea",
            "AG-3",
            "5"
        ],
        [
            "AG-3",
            "maksi",
            "Dark'Un's Hartelijk-Blij",
            "Jeti",
            "HLK",
            "Keida Tirmaste",
            "42.51",
            "4.05",
            "-6.49",
            "10",
            "10",
            "väga hea",
            "AG-3",
            "6"
        ],
        [
            "AG-3",
            "maksi",
            "Cheddarhill Berth Balthasar",
            "Robi",
            "WSS",
            "Tuuli Vaino",
            "56.11",
            "3.07",
            "7.11",
            "5",
            "12.11",
            "väga hea",
            "AG-3",
            "7"
        ],
        [
            "AG-3",
            "maksi",
            "Argovian Irresistible Emotions",
            "Emmi",
            "OES",
            "Keida Tirmaste",
            "49",
            "3.51",
            "0",
            "15",
            "15",
            "väga hea",
            "AG-3",
            "8"
        ],
        [
            "AG-3",
            "maksi",
            "Heleros Zirana",
            "Rexsiina",
            "SLK",
            "Kristiina Mölder",
            "55.78",
            "3.08",
            "6.78",
            "10",
            "16.78",
            "hea",
            "AG-3",
            "9"
        ],
        [
            "AG-3",
            "maksi",
            "Folt-Point-Pollach Bako",
            "Baki",
            "VIZ",
            "Helena Trus ",
            "56.04",
            "3.07",
            "7.04",
            "10",
            "17.04",
            "hea",
            "AG-3",
            "10"
        ],
        [
            "AG-3",
            "maksi",
            "Mortimer",
            "Morti",
            "MIX",
            "Monika Põld",
            "57.19",
            "3.01",
            "8.19",
            "10",
            "18.19",
            "hea",
            "AG-3",
            "11"
        ],
        [
            "AG-3",
            "maksi",
            "Born To Win From Amber Lat",
            "Winnie",
            "BC",
            "Svetlana Zolotnikova",
            "51.65",
            "3.33",
            "2.65",
            "20",
            "22.65",
            "hea",
            "AG-3",
            "12"
        ],
        [
            "AG-3",
            "maksi",
            "Dion's Wheaten Glenn",
            "Glenn",
            "IWT",
            "Tuuli Kauer",
            "64.11",
            "2.68",
            "15.11",
            "10",
            "25.11",
            "hea",
            "AG-3",
            "13"
        ],
        [
            "AG-3",
            "maksi",
            "Sign of Constancy Olivia",
            "Oltsu",
            "IS",
            "Liina Kümnik",
            "64.27",
            "2.68",
            "15.27",
            "10",
            "25.27",
            "hea",
            "AG-3",
            "14"
        ],
        [
            "AG-3",
            "maksi",
            "Yuki",
            "Yuki",
            "MIX",
            "Saara Vällik",
            "",
            "",
            "",
            "",
            "",
            "diskval.",
            "",
            ""
        ],
        [
            "AG-3",
            "maksi",
            "Donna",
            "Donna",
            "MIX",
            "Birjo Nurmoja",
            "",
            "",
            "",
            "",
            "",
            "diskval.",
            "",
            ""
        ],
        [
            "AG-3",
            "maksi",
            "Kiosan's Orion",
            "Uuri",
            "MAL",
            "Stefi Praakli",
            "",
            "",
            "",
            "",
            "",
            "diskval.",
            "",
            ""
        ],
        [
            "AG-3",
            "maksi",
            "Frosty Forest Zeta Prime",
            "Süsi",
            "MAL",
            "Marje Piiroja",
            "",
            "",
            "",
            "",
            "",
            "diskval.",
            "",
            ""
        ],
        [
            "AG-3",
            "maksi",
            "Crispin Castor de Ruwe Kempenaer",
            "Crispin",
            "HKK",
            "Monika Adamson",
            "",
            "",
            "",
            "",
            "",
            "diskval.",
            "",
            ""
        ],
        [
            "AG-3",
            "maksi",
            "Bimbik's Carrie",
            "Carrie",
            "ISS",
            "Aet Leemet",
            "",
            "",
            "",
            "",
            "",
            "diskval.",
            "",
            ""
        ]
    ],
    [
        [
            ""
        ],
        [
            "Otsingu avalehele >>"
        ],
        [
            "Ürituste kalendri avalehele >>"
        ],
        [
            ""
        ]
    ]
]