[
    [
        [
            "Info katse kohta:"
        ],
        [
            "Katse:",
            "",
            "AG võistlus, rada 5 (seenioride EMV, Eesti meistrivõistlused), eelmine rada, järgmine rada"
        ],
        [
            "Aeg:",
            "",
            "15-16.06.2024"
        ],
        [
            "Koht:",
            "",
            "Valgamaa, Kääriku"
        ],
        [
            "Korraldaja:",
            "",
            "Eesti Agilityliit (AGLIIT)"
        ],
        [
            "Kohtunik:",
            "",
            "Neil Ellis"
        ],
        [
            "Ideaalaeg ja -kiirus:",
            "",
            "H OPEN: vmini: 53s (3.66m/s), mini: 50s (3.88m/s), vmaksi: 48s (4.04m/s), maksi: 48s (4.04m/s)"
        ]
    ],
    [
        [
            ""
        ],
        [
            "Tulemused (16):"
        ],
        [
            "Tegemist on koondarvestusega võistluse osaks oleva rajaga. Koondtulemused on nähtavad\n       siin."
        ]
    ],
    [
        [
            "Klass",
            "Koer",
            "Hüüdnimi",
            "Tõug",
            "Koerajuht",
            "Aeg",
            "Kiirus",
            "Ajavead",
            "Vead",
            "Punktid",
            "Hinne",
            "Tulemus",
            "Koht"
        ],
        [
            "H OPEN",
            "vmini",
            "Daktyl Zamlicze",
            "Jossu",
            "NWT",
            "Katrin Bauman",
            "",
            "",
            "",
            "",
            "",
            "diskval.",
            "",
            ""
        ],
        [
            "H OPEN",
            "mini",
            "Apple Seed From Land Of Tethys",
            "Nika",
            "BOT",
            "Marina Laaneväli",
            "35",
            "5.54",
            "-15",
            "0",
            "0",
            "suurepärane",
            "H OPEN",
            "1"
        ],
        [
            "H OPEN",
            "mini",
            "Arte Noble Cambridge Queen",
            "Hetty",
            "CKS",
            "Hille Selg",
            "44.26",
            "4.38",
            "-5.74",
            "0",
            "0",
            "suurepärane",
            "H OPEN",
            "2"
        ],
        [
            "H OPEN",
            "mini",
            "Helandros Thats Amore",
            "Kirsi",
            "CKS",
            "Raili Kaptein",
            "44.48",
            "4.36",
            "-5.52",
            "0",
            "0",
            "suurepärane",
            "H OPEN",
            "3"
        ],
        [
            "H OPEN",
            "mini",
            "Ak Mil Vista License To Love",
            "Grete",
            "WT",
            "Aivar Toms",
            "50.97",
            "3.81",
            "0.97",
            "0",
            "0.97",
            "suurepärane",
            "H OPEN",
            "4"
        ],
        [
            "H OPEN",
            "mini",
            "Red Soil's Cardamom",
            "Iiri",
            "MP",
            "Külli Praakli",
            "32.71",
            "5.93",
            "-17.29",
            "5",
            "5",
            "suurepärane",
            "H OPEN",
            "5"
        ],
        [
            "H OPEN",
            "mini",
            "Flyland Jaunty Fellow",
            "Redži",
            "SHE",
            "Kristina Lukašejeva",
            "48.22",
            "4.02",
            "-1.78",
            "10",
            "10",
            "väga hea",
            "H OPEN",
            "6"
        ],
        [
            "H OPEN",
            "mini",
            "Virginia Woolf Iz Zamka Priora",
            "Sofia",
            "KP",
            "Natalja Šois",
            "",
            "",
            "",
            "",
            "",
            "diskval.",
            "",
            ""
        ],
        [
            "H OPEN",
            "vmaksi",
            "Galactic Power Quick Angel",
            "Gala",
            "BC",
            "Merika Laid",
            "41.72",
            "4.65",
            "-6.28",
            "5",
            "5",
            "suurepärane",
            "H OPEN",
            "1"
        ],
        [
            "H OPEN",
            "vmaksi",
            "Along With You Moravian Dream",
            "Mora",
            "BC",
            "Monika Kiho",
            "",
            "",
            "",
            "",
            "",
            "diskval.",
            "",
            ""
        ],
        [
            "H OPEN",
            "maksi",
            "Tartan Magic Girl Beautyfull Darkness",
            "Tar",
            "GS",
            "Helis Manninen",
            "50.47",
            "3.84",
            "2.47",
            "5",
            "7.47",
            "väga hea",
            "H OPEN",
            "1"
        ],
        [
            "H OPEN",
            "maksi",
            "Thunderstorm Toshigami Fighting Dreamers",
            "Grey",
            "GRO",
            "Natalja Arhipova",
            "32.37",
            "5.99",
            "-15.63",
            "10",
            "10",
            "väga hea",
            "H OPEN",
            "2"
        ],
        [
            "H OPEN",
            "maksi",
            "Xelin Ipel",
            "Xelin",
            "SLK",
            "Merike Rahnik",
            "50.81",
            "3.82",
            "2.81",
            "15",
            "17.81",
            "hea",
            "H OPEN",
            "3"
        ],
        [
            "H OPEN",
            "maksi",
            "Smart Connection Ficentina",
            "Teele",
            "SP",
            "Elina Lasseron",
            "",
            "",
            "",
            "",
            "",
            "diskval.",
            "",
            ""
        ],
        [
            "H OPEN",
            "maksi",
            "Fire Rock Ginger",
            "Sass",
            "BC",
            "Tiina Jürjo",
            "",
            "",
            "",
            "",
            "",
            "diskval.",
            "",
            ""
        ],
        [
            "H OPEN",
            "maksi",
            "Flying Warriors Universe Illumination",
            "Jim",
            "BC",
            "Jana Trepp",
            "",
            "",
            "",
            "",
            "",
            "diskval.",
            "",
            ""
        ]
    ],
    [
        [
            ""
        ],
        [
            "Otsingu avalehele >>"
        ],
        [
            "Ürituste kalendri avalehele >>"
        ],
        [
            ""
        ]
    ]
]