{
  "posts": [
    {
      "id": 1,
      "title": "json-server",
      "author": "typicode"
    }
  ],
  "registerUsers": [
    {
      "personName": {
        "firstName": "Vaibhav",
        "lastName": "Ghyar"
      },
      "email": "vaibhav@gmail.com",
      "mobile": 8605518223,
      "dateOfBirth": "1998-11-07",
      "gender": "Male",
      "countryID": "1",
      "password": "Vg@123",
      "confirmPassword": "Vg@123",
      "id": 1
    },
    {
      "personName": {
        "firstName": "sandesh",
        "lastName": "rathode"
      },
      "email": "sandesh@gmail.com",
      "mobile": 9876543216,
      "dateOfBirth": "1988-11-07",
      "gender": "Male",
      "countryID": "1",
      "password": "Sr@123",
      "confirmPassword": "Sr@123",
      "id": 2
    },
    {
      "personName": {
        "firstName": "Nikhil",
        "lastName": "Chavan"
      },
      "email": "nikhil@gmail.com",
      "mobile": 7249661501,
      "dateOfBirth": "1998-11-07",
      "gender": "Male",
      "countryID": "1",
      "password": "Nc@123",
      "confirmPassword": "Nc@123",
      "id": 3
    },
    {
      "personName": {
        "firstName": "Praniket",
        "lastName": "More"
      },
      "email": "praniket@gmail.com",
      "mobile": 9887654321,
      "dateOfBirth": "1998-09-10",
      "gender": "Male",
      "countryID": "1",
      "password": "Pm@123",
      "confirmPassword": "Pm@123",
      "id": 4
    },
    {
      "personName": {
        "firstName": "",
        "lastName": ""
      },
      "email": "",
      "mobile": "",
      "dateOfBirth": "",
      "gender": "",
      "countryID": "",
      "password": "",
      "confirmPassword": "",
      "id": 5
    },
    {
      "personName": {
        "firstName": "Mandar",
        "lastName": "Naik"
      },
      "email": "naikmandar@gmail",
      "mobile": 9812233445,
      "dateOfBirth": "1998-02-08",
      "gender": "Male",
      "countryID": "1",
      "password": "Mandar@1234",
      "confirmPassword": "Mandar@1234",
      "id": 6
    }
  ],
  "profile": {
    "name": "typicode"
  }
}