<?xml version="1.0" standalone="yes"?>
<svg xmlns="http://www.w3.org/2000/svg" width="673" height="146">
<path style="fill:#fefffc; stroke:none;" d="M0 0L0 146L673 146L673 0L0 0z"/>
<path style="fill:#d3edaf; stroke:none;" d="M155 9L156 10L155 9z"/>
<path style="fill:#b3d286; stroke:none;" d="M156 9L157 10L156 9z"/>
<path style="fill:#d3edaf; stroke:none;" d="M157 9L157 57L158 57C158 43.4735 162.209 21.4143 157 9M153 10L154 11L153 10z"/>
<path style="fill:#b3d286; stroke:none;" d="M154 10L155 11L154 10z"/>
<path style="fill:#9bbd6b; stroke:none;" d="M148 13L148 14L156 12L156 45C155.998 49.9298 156.629 55.1679 152 58L152 59L157 59L157 10L148 13z"/>
<path style="fill:#d3edaf; stroke:none;" d="M151 11L152 12L151 11M149 12L150 13L149 12z"/>
<path style="fill:#b3d286; stroke:none;" d="M152 12L153 13L152 12z"/>
<path style="fill:#8dc542; stroke:none;" d="M122 64L144 59.5903L154.142 57.142L156 45L156 12C148.955 13.0404 130.451 17.9165 125.938 23.5131C123.171 26.9446 124.019 32.9123 123.999 37C123.955 46.0194 122.186 54.9886 122 64z"/>
<path style="fill:#d3edaf; stroke:none;" d="M146 13L147 14L146 13z"/>
<path style="fill:#b3d286; stroke:none;" d="M147 13L148 14L147 13M144.667 14.3333L145.333 14.6667L144.667 14.3333z"/>
<path style="fill:#9bbd6b; stroke:none;" d="M146 14L147 15L146 14z"/>
<path style="fill:#d3edaf; stroke:none;" d="M141 15L142 16L141 15z"/>
<path style="fill:#b3d286; stroke:none;" d="M142 15L143 16L142 15z"/>
<path style="fill:#9bbd6b; stroke:none;" d="M143.667 15.3333L144.333 15.6667L143.667 15.3333z"/>
<path style="fill:#d3edaf; stroke:none;" d="M139 16L140 17L139 16z"/>
<path style="fill:#9bbd6b; stroke:none;" d="M140 16L140 17L143 17L140 16z"/>
<path style="fill:#d3edaf; stroke:none;" d="M136 17L137 18L136 17z"/>
<path style="fill:#9bbd6b; stroke:none;" d="M123 22L123 45L124 45C124 29.0445 123.94 23.2257 140 18L123 22z"/>
<path style="fill:#d3edaf; stroke:none;" d="M133 18L134 19L133 18z"/>
<path style="fill:#b3d286; stroke:none;" d="M134 18L135 19L134 18z"/>
<path style="fill:#d3edaf; stroke:none;" d="M130 19L131 20L130 19z"/>
<path style="fill:#b3d286; stroke:none;" d="M131 19L132 20L131 19z"/>
<path style="fill:#d3edaf; stroke:none;" d="M127 20L128 21L127 20z"/>
<path style="fill:#b3d286; stroke:none;" d="M128 20L129 21L128 20M132 20L133 21L132 20z"/>
<path style="fill:#d3edaf; stroke:none;" d="M124 21L125 22L124 21z"/>
<path style="fill:#b3d286; stroke:none;" d="M125 21L126 22L125 21z"/>
<path style="fill:#d3edaf; stroke:none;" d="M113.667 24.3333L114.333 24.6667L113.667 24.3333z"/>
<path style="fill:#b3d286; stroke:none;" d="M115 24L116 25L115 24z"/>
<path style="fill:#d3edaf; stroke:none;" d="M116 24L116 31L117 31L116 24M110 25L111 26L110 25z"/>
<path style="fill:#b3d286; stroke:none;" d="M111 25L112 26L111 25z"/>
<path style="fill:#9bbd6b; stroke:none;" d="M88 31L88 32L115 26L115 39L116 39L116 25L88 31z"/>
<path style="fill:#d3edaf; stroke:none;" d="M106 26L107 27L106 26z"/>
<path style="fill:#b3d286; stroke:none;" d="M107 26L108 27L107 26z"/>
<path style="fill:#8dc542; stroke:none;" d="M115 26C101.026 28.0637 86.7866 32.3849 73 35.5718C55.7816 39.552 34.8682 43.1064 22.5285 57.1736C10.5612 70.8164 8.72372 89.9489 12.7299 107C14.2022 113.266 18.1375 123.628 24.3102 126.762C27.9013 128.586 30.8679 124.296 32.9498 121.995C39.4527 114.81 45.5438 107.606 53.1296 101.508C64.829 92.1025 76.8798 84.0875 90.1698 76.9807C96.2769 73.7149 106.809 72.4728 111.062 66.6096C117.425 57.8376 115 36.4339 115 26z"/>
<path style="fill:#d3edaf; stroke:none;" d="M102 27L103 28L102 27z"/>
<path style="fill:#b3d286; stroke:none;" d="M103.667 27.3333L104.333 27.6667L103.667 27.3333z"/>
<path style="fill:#d3edaf; stroke:none;" d="M98 28L99 29L98 28z"/>
<path style="fill:#b3d286; stroke:none;" d="M99.6667 28.3333L100.333 28.6667L99.6667 28.3333z"/>
<path style="fill:#d3edaf; stroke:none;" d="M94.6667 29.3333L95.3333 29.6667L94.6667 29.3333M89.6667 30.3333L90.3333 30.6667L89.6667 30.3333z"/>
<path style="fill:#b3d286; stroke:none;" d="M91 30L92 31L91 30z"/>
<path style="fill:#d3edaf; stroke:none;" d="M84.6667 31.3333L85.3333 31.6667L84.6667 31.3333z"/>
<path style="fill:#b3d286; stroke:none;" d="M86.6667 31.3333L87.3333 31.6667L86.6667 31.3333z"/>
<path style="fill:#d3edaf; stroke:none;" d="M79 32L79 33L82 33L79 32z"/>
<path style="fill:#b3d286; stroke:none;" d="M82 32L83 33L82 32z"/>
<path style="fill:#9bbd6b; stroke:none;" d="M83 32L83 33L86 33L83 32z"/>
<path style="fill:#d3edaf; stroke:none;" d="M75.6667 33.3333L76.3333 33.6667L75.6667 33.3333z"/>
<path style="fill:#b3d286; stroke:none;" d="M77 33L78 34L77 33z"/>
<path style="fill:#9bbd6b; stroke:none;" d="M78.6667 33.3333L79.3333 33.6667L78.6667 33.3333z"/>
<path style="fill:#d3edaf; stroke:none;" d="M70.6667 34.3333L71.3333 34.6667L70.6667 34.3333z"/>
<path style="fill:#b3d286; stroke:none;" d="M72 34L73 35L72 34z"/>
<path style="fill:#9bbd6b; stroke:none;" d="M60 37L60 38L78 35L60 37z"/>
<path style="fill:#d3edaf; stroke:none;" d="M65.6667 35.3333L66.3333 35.6667L65.6667 35.3333z"/>
<path style="fill:#b3d286; stroke:none;" d="M67 35L68 36L67 35z"/>
<path style="fill:#d3edaf; stroke:none;" d="M61.6667 36.3333L62.3333 36.6667L61.6667 36.3333z"/>
<path style="fill:#b3d286; stroke:none;" d="M63 36L64 37L63 36z"/>
<path style="fill:#d3edaf; stroke:none;" d="M122 36L122 45L123 45L122 36M58 37L59 38L58 37z"/>
<path style="fill:#b3d286; stroke:none;" d="M59 37L60 38L59 37z"/>
<path style="fill:#d3edaf; stroke:none;" d="M54 38L55 39L54 38z"/>
<path style="fill:#b3d286; stroke:none;" d="M55 38L56 39L55 38z"/>
<path style="fill:#9bbd6b; stroke:none;" d="M56 38L56 39L59 39L56 38z"/>
<path style="fill:#d3edaf; stroke:none;" d="M51 39L52 40L51 39z"/>
<path style="fill:#b3d286; stroke:none;" d="M52 39L53 40L52 39z"/>
<path style="fill:#9bbd6b; stroke:none;" d="M53 39L53 40L56 40L53 39z"/>
<path style="fill:#b3d286; stroke:none;" d="M115 39L115 44L116 44L115 39z"/>
<path style="fill:#d3edaf; stroke:none;" d="M48 40L49 41L48 40z"/>
<path style="fill:#b3d286; stroke:none;" d="M49 40L50 41L49 40z"/>
<path style="fill:#9bbd6b; stroke:none;" d="M50 40L50 41L53 41L50 40z"/>
<path style="fill:#d3edaf; stroke:none;" d="M45 41L46 42L45 41z"/>
<path style="fill:#b3d286; stroke:none;" d="M46 41L47 42L46 41z"/>
<path style="fill:#9bbd6b; stroke:none;" d="M47.6667 41.3333L48.3333 41.6667L47.6667 41.3333z"/>
<path style="fill:#d3edaf; stroke:none;" d="M42 42L43 43L42 42z"/>
<path style="fill:#b3d286; stroke:none;" d="M43 42L44 43L43 42z"/>
<path style="fill:#9bbd6b; stroke:none;" d="M34 47L34 48L47 43L34 47M114 42L114 53L115 53L114 42z"/>
<path style="fill:#d3edaf; stroke:none;" d="M40 43L41 44L40 43z"/>
<path style="fill:#b3d286; stroke:none;" d="M41 43L42 44L41 43z"/>
<path style="fill:#d3edaf; stroke:none;" d="M198 43L199 44L198 43z"/>
<path style="fill:#b3d286; stroke:none;" d="M199 43L199 44L202 44L199 43z"/>
<path style="fill:#9bbd6b; stroke:none;" d="M196 119C192.855 102.06 195 83.2083 195 66C195 60.7654 193.194 51.4324 197.318 47.4336C200.376 44.4683 205.096 45.0015 209 45C218.556 44.9963 236.19 41.5441 244.852 45.4645C255.589 50.3241 240.149 54.9997 236 55L227 55L211 55L211 56L249 56L249 43L213 43C208.17 43 201.48 42.1616 197.228 44.9884C192.691 48.0059 194 55.3336 194 60L194 103C194 107.577 192.342 115.803 196 119z"/>
<path style="fill:#d3edaf; stroke:none;" d="M249 43L249 56L220 56L210.028 57.6034L209 73L239 73L239 72L210 72L210 57L250 57L249 43M438 43L438 96L439 96L439 60L438 43z"/>
<path style="fill:#9bbd6b; stroke:none;" d="M439 43L439 81L440 81C440 71.2868 437.747 58.4211 440.318 49.0586C442.107 42.5447 448.956 45.621 452 49C452.939 42.4693 443.345 43.0029 439 43z"/>
<path style="fill:#b3d286; stroke:none;" d="M448 43L449 44L448 43z"/>
<path style="fill:#d3edaf; stroke:none;" d="M449 43L450 44L449 43M614 43L614 119L615 119L615 67L614 43z"/>
<path style="fill:#9bbd6b; stroke:none;" d="M615 43L615 101C615 105.577 612.7 117.864 618 119C612.831 102.694 616 82.0206 616 65C616 60.2725 614.141 50.27 617.742 46.6034C621.157 43.1263 626.921 46.1908 628.397 50.0193C631.418 57.8599 629 70.6236 629 79C631.513 73.0103 632.573 50.2165 627.697 45.4583C624.513 42.3516 619.068 43.0086 615 43z"/>
<path style="fill:#b3d286; stroke:none;" d="M623 43L624 44L623 43z"/>
<path style="fill:#d3edaf; stroke:none;" d="M625 43L626 44L625 43M38 44L39 45L38 44z"/>
<path style="fill:#b3d286; stroke:none;" d="M39 44L40 45L39 44z"/>
<path style="fill:#d3edaf; stroke:none;" d="M115 44L115 50L116 50L115 44z"/>
<path style="fill:#8dc542; stroke:none;" d="M242.981 44.6528C231.487 44.041 219.548 44.9955 208 45C204.055 45.0015 198.441 44.281 196.028 48.2284C193.499 52.3648 195 60.3161 195 65L195 105C195 111.382 193.422 119.196 201.988 118.976C215.361 118.633 202.887 93.3167 209.603 86.7423C215.605 80.8673 234.167 90.4733 236.508 79C238.356 69.9414 214.853 76.2179 210.318 72.3966C206.159 68.8926 206.865 57.9153 212.059 55.7423C222.021 51.5735 236.081 59.1213 245.682 54.3966C250.387 52.0811 247.575 44.8973 242.981 44.6528z"/>
<path style="fill:#b3d286; stroke:none;" d="M450 44L451 45L450 44z"/>
<path style="fill:#d3edaf; stroke:none;" d="M627 44L628 45L627 44M36 45L37 46L36 45z"/>
<path style="fill:#b3d286; stroke:none;" d="M37 45L38 46L37 45M122 45L122 48L123 48L122 45z"/>
<path style="fill:#8dc542; stroke:none;" d="M453 68C452.721 63.2949 454.196 36.062 441.603 46.0278C437.138 49.5618 440.023 67.6049 439.999 73C439.902 94.9506 437.574 119.036 467 119C471.433 118.995 475.877 118.883 480 117.03C499.849 108.11 497.324 68.5259 477 61.6736C467.538 58.4835 460.72 63.2405 453 68M629 118C629 113.828 627.226 92.8426 634.914 94.7515C641.974 96.5042 644.652 111.811 649.599 116.681C652.941 119.973 659.611 118.848 664 119C662.769 106.982 646.096 94.6155 647.461 83.0895C648.383 75.3105 660.364 69.7535 663 62L649.004 63.3179L630 82C629.235 75.944 629 70.1099 629 64C629 59.4767 630.359 52.1788 627.972 48.1481C626.155 45.0796 619.686 43.4383 617.179 46.6034C614.386 50.1298 616 58.7468 616 63L616 101C616 105.53 614.722 112.694 617.318 116.682C619.702 120.345 625.457 118.28 629 118z"/>
<path style="fill:#d3edaf; stroke:none;" d="M628 45L629 46L628 45M34 46L35 47L34 46z"/>
<path style="fill:#b3d286; stroke:none;" d="M35 46L36 47L35 46M452 46L453 47L452 46z"/>
<path style="fill:#d3edaf; stroke:none;" d="M629 46L630 47L629 46z"/>
<path style="fill:#b3d286; stroke:none;" d="M33 47L34 48L33 47M194 47L195 48L194 47z"/>
<path style="fill:#d3edaf; stroke:none;" d="M453 47L454 48L453 47M31 48L32 49L31 48z"/>
<path style="fill:#9bbd6b; stroke:none;" d="M32 48L33 49L32 48M122 48L120 66L131 64L131 63L122 64L122 48z"/>
<path style="fill:#b3d286; stroke:none;" d="M453 48C453 53.2494 450.865 64.387 455 68L453 48z"/>
<path style="fill:#d3edaf; stroke:none;" d="M29 49L28 51L29 49z"/>
<path style="fill:#b3d286; stroke:none;" d="M30 49L31 50L30 49z"/>
<path style="fill:#d3edaf; stroke:none;" d="M193 49L194 50L193 49M630 49L631 50L630 49z"/>
<path style="fill:#9bbd6b; stroke:none;" d="M16 65L31 50C24.1244 52.6637 19.235 58.5057 16 65z"/>
<path style="fill:#b3d286; stroke:none;" d="M193.333 50.6667L193.667 51.3333L193.333 50.6667M630.333 50.6667L630.667 51.3333L630.333 50.6667M27 51L28 52L27 51z"/>
<path style="fill:#d3edaf; stroke:none;" d="M121 52L121 55L122 55L121 52M193 52L193 55L194 55L193 52M630 52L630 55L631 55L630 52M24 53L25 54L24 53z"/>
<path style="fill:#b3d286; stroke:none;" d="M26 53L27 54L26 53M114 53L114 56L115 56L114 53z"/>
<path style="fill:#d3edaf; stroke:none;" d="M23 54L24 55L23 54M22 55L23 56L22 55z"/>
<path style="fill:#b3d286; stroke:none;" d="M121 55L121 58L122 58L121 55M193 55L194 56L193 55M630 55L631 56L630 55z"/>
<path style="fill:#d3edaf; stroke:none;" d="M21 56L22 57L21 56z"/>
<path style="fill:#9bbd6b; stroke:none;" d="M113 56L113 61L114 61L113 56z"/>
<path style="fill:#d3edaf; stroke:none;" d="M114 56L114 59L115 59L114 56M193 56L193 114L194 114L194 75L193 56z"/>
<path style="fill:#b3d286; stroke:none;" d="M209 56L210 57L209 56z"/>
<path style="fill:#d3edaf; stroke:none;" d="M630 56L630 81L633 80L633 79L630 56z"/>
<path style="fill:#9bbd6b; stroke:none;" d="M208 57L208 72L209 72L208 57z"/>
<path style="fill:#d3edaf; stroke:none;" d="M19 58L20 59L19 58z"/>
<path style="fill:#b3d286; stroke:none;" d="M19 59L20 60L19 59z"/>
<path style="fill:#9bbd6b; stroke:none;" d="M133 62L133 63L151 60L133 62z"/>
<path style="fill:#b3d286; stroke:none;" d="M151 59L152 60L151 59z"/>
<path style="fill:#d3edaf; stroke:none;" d="M152 59L152 60L156 60L152 59M270 59L270 60L273 60L270 59z"/>
<path style="fill:#b3d286; stroke:none;" d="M273 59L273 60L276 60L273 59z"/>
<path style="fill:#9bbd6b; stroke:none;" d="M257 75C257.244 63.1746 270.205 62.1181 279 60C272.781 58.0872 264.079 61.1227 259.468 65.5293C256.848 68.034 253.844 72.1117 257 75z"/>
<path style="fill:#b3d286; stroke:none;" d="M279 59L279 60L285 60L279 59z"/>
<path style="fill:#d3edaf; stroke:none;" d="M285.667 59.3333L286.333 59.6667L285.667 59.3333M364.667 59.3333L365.333 59.6667L364.667 59.3333z"/>
<path style="fill:#b3d286; stroke:none;" d="M366 59L366 60L369 60L366 59z"/>
<path style="fill:#9bbd6b; stroke:none;" d="M369 59L372 61L369 59z"/>
<path style="fill:#b3d286; stroke:none;" d="M371.667 59.3333L372.333 59.6667L371.667 59.3333z"/>
<path style="fill:#9bbd6b; stroke:none;" d="M373 59L387 64L387 63L373 59z"/>
<path style="fill:#b3d286; stroke:none;" d="M374 59L375 60L374 59z"/>
<path style="fill:#d3edaf; stroke:none;" d="M375 59L375 60L378 60L375 59M399 59L399 60L402 60L399 59z"/>
<path style="fill:#b3d286; stroke:none;" d="M402 59L402 60L405 60L402 59z"/>
<path style="fill:#9bbd6b; stroke:none;" d="M391 63L391 64L407 59L391 63z"/>
<path style="fill:#b3d286; stroke:none;" d="M407 59L407 60L411 60L407 59z"/>
<path style="fill:#d3edaf; stroke:none;" d="M411.667 59.3333L412.333 59.6667L411.667 59.3333M464.667 59.3333L465.333 59.6667L464.667 59.3333z"/>
<path style="fill:#b3d286; stroke:none;" d="M466.667 59.3333L467.333 59.6667L466.667 59.3333z"/>
<path style="fill:#9bbd6b; stroke:none;" d="M455 67C470.841 58.0198 487.188 60.7491 492 81C497.595 62.0264 465.295 53.1445 455 67z"/>
<path style="fill:#b3d286; stroke:none;" d="M472 59L472 60L475 60L472 59z"/>
<path style="fill:#d3edaf; stroke:none;" d="M475 59L476 60L475 59M517 59L517 60L520 60L517 59z"/>
<path style="fill:#b3d286; stroke:none;" d="M520.667 59.3333L521.333 59.6667L520.667 59.3333z"/>
<path style="fill:#9bbd6b; stroke:none;" d="M522 59L522 61L534 61L522 59z"/>
<path style="fill:#b3d286; stroke:none;" d="M528 59L528 60L531 60L528 59z"/>
<path style="fill:#d3edaf; stroke:none;" d="M531 59L532 60L531 59M575.667 59.3333L576.333 59.6667L575.667 59.3333z"/>
<path style="fill:#b3d286; stroke:none;" d="M577 59L577 60L580 60L577 59z"/>
<path style="fill:#9bbd6b; stroke:none;" d="M559 74L560 74C571.08 58.5997 593.807 54.274 604.641 73.0147C610.369 82.9222 609.014 93.3086 607 104C615.088 92.2287 608.989 69.361 596.999 62.5332C584.502 55.4167 563.938 59.4751 559 74z"/>
<path style="fill:#b3d286; stroke:none;" d="M586.667 59.3333L587.333 59.6667L586.667 59.3333z"/>
<path style="fill:#d3edaf; stroke:none;" d="M588 59L588 60L591 60L588 59z"/>
<path style="fill:#b3d286; stroke:none;" d="M18 60L19 61L18 60z"/>
<path style="fill:#d3edaf; stroke:none;" d="M120 60L120 64L121 64L120 60z"/>
<path style="fill:#b3d286; stroke:none;" d="M145 60L146 61L145 60z"/>
<path style="fill:#d3edaf; stroke:none;" d="M146 60L146 61L149 61L146 60M266 60L267 61L266 60z"/>
<path style="fill:#b3d286; stroke:none;" d="M267 60L268 61L267 60z"/>
<path style="fill:#8dc542; stroke:none;" d="M257 69L256 74L288 72C288 74.7707 289.727 78.0577 288 80C279.116 89.995 258.295 79.8194 254 97C248.07 120.721 279.893 124.405 294 115C304.671 107.886 299.179 93.928 301 83C302.315 75.111 300.527 65.5531 292 62C284.976 59.0732 273.109 59.6303 266 62C261.584 63.4721 259.216 69.5539 257 69z"/>
<path style="fill:#9bbd6b; stroke:none;" d="M281 60L281 61C294.066 61.2711 300.999 68.1091 301 81C307.791 67.4809 291.89 60.0301 281 60z"/>
<path style="fill:#b3d286; stroke:none;" d="M289 60L290 61L289 60z"/>
<path style="fill:#d3edaf; stroke:none;" d="M290.667 60.3333L291.333 60.6667L290.667 60.3333M327 60L327 62L329 62L327 60M332 60L332 61L341 61L332 60M360 60L361 61L360 60z"/>
<path style="fill:#b3d286; stroke:none;" d="M361 60L362 61L361 60z"/>
<path style="fill:#9bbd6b; stroke:none;" d="M355 63L355 64L368 61L355 63z"/>
<path style="fill:#8dc542; stroke:none;" d="M368 60.5231C345.837 62.5995 345 80.9873 345 99C345 104.146 342.543 116.896 349.059 118.682C358.729 121.333 359 114.299 359 107C359 96.7632 354.166 68.2901 372 71.233C386.298 73.5924 382 95.8189 382 106C382 110.261 380.421 117.728 386.059 118.768C394.152 120.26 394.997 114.323 395 108C395.005 97.5597 390.586 63.485 410.985 72.0093C420.901 76.1532 417.972 97.1164 418.001 106C418.02 111.761 418.344 118.785 425.981 118.782C432.624 118.78 431 110.506 431 106C431 94.1243 433.958 78.0193 425.942 68.1049C415.131 54.7329 401.335 64.5345 388.424 64.0787C381.442 63.8322 375.378 59.832 368 60.5231z"/>
<path style="fill:#b3d286; stroke:none;" d="M380 60L381 61L380 60z"/>
<path style="fill:#d3edaf; stroke:none;" d="M381.667 60.3333L382.333 60.6667L381.667 60.3333M395.667 60.3333L396.333 60.6667L395.667 60.3333z"/>
<path style="fill:#9bbd6b; stroke:none;" d="M408 60L408 61L414 61L408 60z"/>
<path style="fill:#b3d286; stroke:none;" d="M414 60L415 61L414 60z"/>
<path style="fill:#d3edaf; stroke:none;" d="M415 60L415 61L418 61L415 60z"/>
<path style="fill:#b3d286; stroke:none;" d="M462 60L463 61L462 60M477 60L478 61L477 60z"/>
<path style="fill:#d3edaf; stroke:none;" d="M478 60L479 61L478 60M514 60L515 61L514 60z"/>
<path style="fill:#b3d286; stroke:none;" d="M515 60L516 61L515 60z"/>
<path style="fill:#9bbd6b; stroke:none;" d="M499 82L500 82C501.663 70.9074 509.904 62.526 521 61C509.351 56.4641 499.838 72.4572 499 82z"/>
<path style="fill:#8dc542; stroke:none;" d="M521 60.7492C489.61 62.6041 492.093 120.414 524 119.405C551.579 118.533 562.895 78.6103 538.911 63.4823C533.976 60.3701 526.688 60.4131 521 60.7492z"/>
<path style="fill:#b3d286; stroke:none;" d="M534 60L535 61L534 60z"/>
<path style="fill:#d3edaf; stroke:none;" d="M535 60L536 61L535 60M572 60L573 61L572 60z"/>
<path style="fill:#b3d286; stroke:none;" d="M573 60L574 61L573 60z"/>
<path style="fill:#8dc542; stroke:none;" d="M580 60.4321C556.762 63.4937 548.023 96.8725 564.705 113.073C571.195 119.375 581.445 120.095 590 118.787C620.81 114.076 612.997 56.0846 580 60.4321z"/>
<path style="fill:#b3d286; stroke:none;" d="M592 60L593 61L592 60z"/>
<path style="fill:#d3edaf; stroke:none;" d="M593 60L594 61L593 60M649 60L650 61L649 60z"/>
<path style="fill:#b3d286; stroke:none;" d="M650 60L651 61L650 60z"/>
<path style="fill:#d3edaf; stroke:none;" d="M651 60L651 61L655 61L651 60z"/>
<path style="fill:#b3d286; stroke:none;" d="M655 60L656 61L655 60z"/>
<path style="fill:#d3edaf; stroke:none;" d="M656 60L656 61L667 61L664 65L668 60L656 60M17 61L18 62L17 61z"/>
<path style="fill:#b3d286; stroke:none;" d="M113 61L113 64L114 64L113 61M140 61L141 62L140 61z"/>
<path style="fill:#d3edaf; stroke:none;" d="M141.667 61.3333L142.333 61.6667L141.667 61.3333M264 61L265 62L264 61z"/>
<path style="fill:#b3d286; stroke:none;" d="M265 61L266 62L265 61M292 61L293 62L292 61z"/>
<path style="fill:#d3edaf; stroke:none;" d="M293 61L294 62L293 61z"/>
<path style="fill:#b3d286; stroke:none;" d="M329 61L330 62L329 61z"/>
<path style="fill:#9bbd6b; stroke:none;" d="M308 87L309 87C309.263 77.9387 314.678 69.1946 323 65.2631C329.367 62.2552 338.28 59.5608 339 69L340 69L340 61C323.147 61.0019 308.158 68.1621 308 87z"/>
<path style="fill:#b3d286; stroke:none;" d="M340 61L340 76L341 76L340 61z"/>
<path style="fill:#d3edaf; stroke:none;" d="M357 61L358 62L357 61z"/>
<path style="fill:#b3d286; stroke:none;" d="M358 61L359 62L358 61z"/>
<path style="fill:#d3edaf; stroke:none;" d="M383 61L384 62L383 61M393 61L394 62L393 61z"/>
<path style="fill:#9bbd6b; stroke:none;" d="M415 61L415 62C423.009 64.314 426.954 69.5126 430 77L431 77C429.658 68.0782 423.852 62.5789 415 61z"/>
<path style="fill:#b3d286; stroke:none;" d="M418 61L419 62L418 61z"/>
<path style="fill:#d3edaf; stroke:none;" d="M419 61L420 62L419 61z"/>
<path style="fill:#b3d286; stroke:none;" d="M460 61L461 62L460 61z"/>
<path style="fill:#d3edaf; stroke:none;" d="M480 61L480 62L483 63L480 61M511 61L512 62L511 61z"/>
<path style="fill:#b3d286; stroke:none;" d="M512 61L513 62L512 61z"/>
<path style="fill:#9bbd6b; stroke:none;" d="M535 61L535 62C542.827 65.7547 547.255 71.9371 550 80L551 80C548.91 71.1989 543.998 63.6727 535 61z"/>
<path style="fill:#d3edaf; stroke:none;" d="M537 61L538 62L537 61M569 61L570 62L569 61z"/>
<path style="fill:#b3d286; stroke:none;" d="M570 61L571 62L570 61z"/>
<path style="fill:#d3edaf; stroke:none;" d="M595 61L596 62L595 61z"/>
<path style="fill:#b3d286; stroke:none;" d="M648 61L647 63L648 61z"/>
<path style="fill:#9bbd6b; stroke:none;" d="M644 67C650.72 62.8758 655.178 62 663 62L647 82L667 61C658.282 61 649.691 59.1827 644 67z"/>
<path style="fill:#b3d286; stroke:none;" d="M135.667 62.3333L136.333 62.6667L135.667 62.3333z"/>
<path style="fill:#d3edaf; stroke:none;" d="M137 62L138 63L137 62M262 62L263 63L262 62z"/>
<path style="fill:#b3d286; stroke:none;" d="M263 62L264 63L263 62M294 62L295 63L294 62z"/>
<path style="fill:#d3edaf; stroke:none;" d="M295 62L296 63L295 62M324 62L325 63L324 62z"/>
<path style="fill:#b3d286; stroke:none;" d="M325 62L326 63L325 62z"/>
<path style="fill:#8dc542; stroke:none;" d="M330 62.598C311.788 66.9117 308.432 80.5223 308.957 97C309.202 104.703 304.071 123.166 318.772 117.987C325.966 115.452 320.977 93.1252 321.978 87C323.962 74.8625 334.501 80.0812 338.933 72.686C343.025 65.8566 335.952 61.1883 330 62.598z"/>
<path style="fill:#d3edaf; stroke:none;" d="M355 62L356 63L355 62z"/>
<path style="fill:#b3d286; stroke:none;" d="M356 62L357 63L356 62z"/>
<path style="fill:#d3edaf; stroke:none;" d="M385 62L386 63L385 62M391 62L392 63L391 62z"/>
<path style="fill:#b3d286; stroke:none;" d="M420 62L421 63L420 62z"/>
<path style="fill:#d3edaf; stroke:none;" d="M458 62L459 63L458 62z"/>
<path style="fill:#b3d286; stroke:none;" d="M461 62L462 63L461 62M481 62L482 63L481 62z"/>
<path style="fill:#d3edaf; stroke:none;" d="M510 62L511 63L510 62M539 62L540 63L539 62M567 62L568 63L567 62z"/>
<path style="fill:#b3d286; stroke:none;" d="M568 62L569 63L568 62z"/>
<path style="fill:#d3edaf; stroke:none;" d="M597 62L598 63L597 62M646.333 62.6667L646.667 63.3333L646.333 62.6667z"/>
<path style="fill:#b3d286; stroke:none;" d="M16 63L17 64L16 63z"/>
<path style="fill:#9bbd6b; stroke:none;" d="M112 63C108.851 73.6359 93.498 70.967 88 79C94.0154 76.5321 115.155 71.4059 112 63z"/>
<path style="fill:#b3d286; stroke:none;" d="M131 63L132 64L131 63z"/>
<path style="fill:#d3edaf; stroke:none;" d="M132.667 63.3333L133.333 63.6667L132.667 63.3333M260 63L261 64L260 63z"/>
<path style="fill:#b3d286; stroke:none;" d="M261 63L262 64L261 63z"/>
<path style="fill:#d3edaf; stroke:none;" d="M296.667 63.3333L297.333 63.6667L296.667 63.3333M321 63L322 64L321 63z"/>
<path style="fill:#b3d286; stroke:none;" d="M322 63L323 64L322 63z"/>
<path style="fill:#d3edaf; stroke:none;" d="M353 63L354 64L353 63z"/>
<path style="fill:#b3d286; stroke:none;" d="M354 63L355 64L354 63z"/>
<path style="fill:#d3edaf; stroke:none;" d="M387 63L387 64L390 64L387 63z"/>
<path style="fill:#b3d286; stroke:none;" d="M390 63L391 64L390 63M422 63L423 64L422 63M457 63L458 64L457 63z"/>
<path style="fill:#d3edaf; stroke:none;" d="M483 63L484 64L483 63M508 63L509 64L508 63M541 63L542 64L541 63M566 63L567 64L566 63z"/>
<path style="fill:#b3d286; stroke:none;" d="M598 63L599 64L598 63z"/>
<path style="fill:#d3edaf; stroke:none;" d="M599 63L600 64L599 63M15 64L16 65L15 64M113.333 64.6667L113.667 65.3333L113.333 64.6667z"/>
<path style="fill:#b3d286; stroke:none;" d="M120 64L121 65L120 64M127 64L128 65L127 64z"/>
<path style="fill:#d3edaf; stroke:none;" d="M128.667 64.3333L129.333 64.6667L128.667 64.3333z"/>
<path style="fill:#b3d286; stroke:none;" d="M260 64L261 65L260 64M297 64L298 65L297 64M320 64L321 65L320 64M352 64L353 65L352 64z"/>
<path style="fill:#9bbd6b; stroke:none;" d="M353 64L354 65L353 64z"/>
<path style="fill:#b3d286; stroke:none;" d="M388 64L389 65L388 64z"/>
<path style="fill:#d3edaf; stroke:none;" d="M424 64L425 65L424 64z"/>
<path style="fill:#9bbd6b; stroke:none;" d="M452.333 64.6667L452.667 65.3333L452.333 64.6667z"/>
<path style="fill:#b3d286; stroke:none;" d="M456 64L457 65L456 64M484 64L485 65L484 64z"/>
<path style="fill:#d3edaf; stroke:none;" d="M507 64L508 65L507 64z"/>
<path style="fill:#b3d286; stroke:none;" d="M542 64L543 65L542 64M565 64L566 65L565 64z"/>
<path style="fill:#d3edaf; stroke:none;" d="M600 64L601 65L600 64M645 64L646 65L645 64z"/>
<path style="fill:#b3d286; stroke:none;" d="M15 65L16 66L15 65M123 65L124 66L123 65z"/>
<path style="fill:#d3edaf; stroke:none;" d="M124.667 65.3333L125.333 65.6667L124.667 65.3333z"/>
<path style="fill:#b3d286; stroke:none;" d="M298 65L299 66L298 65z"/>
<path style="fill:#d3edaf; stroke:none;" d="M318 65L319 66L318 65z"/>
<path style="fill:#9bbd6b; stroke:none;" d="M345 82L346 82L353 65C346.512 68.3175 345.141 75.2117 345 82z"/>
<path style="fill:#b3d286; stroke:none;" d="M425 65L426 66L425 65z"/>
<path style="fill:#d3edaf; stroke:none;" d="M454 65L454 67L456 65L454 65z"/>
<path style="fill:#b3d286; stroke:none;" d="M506 65L507 66L506 65M543 65L544 66L543 65M564 65L565 66L564 65z"/>
<path style="fill:#d3edaf; stroke:none;" d="M601 65L602 66L601 65M644 65L645 66L644 65z"/>
<path style="fill:#b3d286; stroke:none;" d="M663 65L664 66L663 65z"/>
<path style="fill:#d3edaf; stroke:none;" d="M14 66L15 67L14 66z"/>
<path style="fill:#9bbd6b; stroke:none;" d="M15 66L11 80L12 80L15 66z"/>
<path style="fill:#b3d286; stroke:none;" d="M120 66L121 67L120 66z"/>
<path style="fill:#d3edaf; stroke:none;" d="M121 66L122 67L121 66z"/>
<path style="fill:#b3d286; stroke:none;" d="M258 66L259 67L258 66M299 66L300 67L299 66M317 66L318 67L317 66M486 66L487 67L486 66M505 66L506 67L505 66z"/>
<path style="fill:#d3edaf; stroke:none;" d="M544 66L545 67L544 66z"/>
<path style="fill:#b3d286; stroke:none;" d="M563 66L564 67L563 66z"/>
<path style="fill:#d3edaf; stroke:none;" d="M602 66L603 67L602 66z"/>
<path style="fill:#b3d286; stroke:none;" d="M662 66L663 67L662 66M14 67L15 68L14 67z"/>
<path style="fill:#d3edaf; stroke:none;" d="M153 67L153 68L156 68L153 67z"/>
<path style="fill:#b3d286; stroke:none;" d="M257 67L258 68L257 67M300 67L301 68L300 67z"/>
<path style="fill:#d3edaf; stroke:none;" d="M348 67L349 68L348 67z"/>
<path style="fill:#b3d286; stroke:none;" d="M427 67L428 68L427 67M487 67L488 68L487 67z"/>
<path style="fill:#d3edaf; stroke:none;" d="M504 67L505 68L504 67M545 67L546 68L545 67z"/>
<path style="fill:#b3d286; stroke:none;" d="M562 67L563 68L562 67z"/>
<path style="fill:#d3edaf; stroke:none;" d="M603 67L604 68L603 67z"/>
<path style="fill:#9bbd6b; stroke:none;" d="M643 67L644 68L643 67z"/>
<path style="fill:#b3d286; stroke:none;" d="M661 67L662 68L661 67M112 68L111 70L112 68z"/>
<path style="fill:#d3edaf; stroke:none;" d="M146 68L146 69L150 69L146 68z"/>
<path style="fill:#b3d286; stroke:none;" d="M150 68L151 69L150 68z"/>
<path style="fill:#9bbd6b; stroke:none;" d="M146 69L146 70L153 69L153 78L154 78L156 68L146 69z"/>
<path style="fill:#d3edaf; stroke:none;" d="M256 68L257 69L256 68M301 68L302 69L301 68z"/>
<path style="fill:#b3d286; stroke:none;" d="M348 68L349 69L348 68z"/>
<path style="fill:#d3edaf; stroke:none;" d="M428 68L429 69L428 68M488 68L489 69L488 68M503 68L504 69L503 68M546 68L547 69L546 68z"/>
<path style="fill:#b3d286; stroke:none;" d="M561 68L562 69L561 68z"/>
<path style="fill:#9bbd6b; stroke:none;" d="M642 68L632 81C636.159 78.7729 642.163 72.9377 642 68z"/>
<path style="fill:#b3d286; stroke:none;" d="M13 69L14 70L13 69z"/>
<path style="fill:#d3edaf; stroke:none;" d="M112 69L113 70L112 69M142.667 69.3333L143.333 69.6667L142.667 69.3333z"/>
<path style="fill:#b3d286; stroke:none;" d="M144.667 69.3333L145.333 69.6667L144.667 69.3333z"/>
<path style="fill:#8dc542; stroke:none;" d="M92 136C115.526 138.127 139.246 110.863 147.822 92C150.934 85.1545 154.642 76.5824 153 69C144.311 70.637 126.154 71.0965 119.742 77.7276C115.398 82.2198 113.536 96.7797 111.302 103C106.879 115.316 99.1014 125.254 92 136z"/>
<path style="fill:#b3d286; stroke:none;" d="M155 69L156 70L155 69M258 69L259 70L258 69M301 69L302 70L301 69M347 69L348 70L347 69z"/>
<path style="fill:#d3edaf; stroke:none;" d="M547 69L548 70L547 69M560 69L561 70L560 69z"/>
<path style="fill:#b3d286; stroke:none;" d="M604 69L605 70L604 69M641 69L642 70L641 69M659 69L660 70L659 69M108 70L109 71L108 70z"/>
<path style="fill:#d3edaf; stroke:none;" d="M109 70L110 71L109 70M137.667 70.3333L138.333 70.6667L137.667 70.3333z"/>
<path style="fill:#b3d286; stroke:none;" d="M139 70L140 71L139 70z"/>
<path style="fill:#9bbd6b; stroke:none;" d="M140 70L140 71L145 71L140 70z"/>
<path style="fill:#d3edaf; stroke:none;" d="M155.333 70.6667L155.667 71.3333L155.333 70.6667M255 70L256 71L255 70z"/>
<path style="fill:#9bbd6b; stroke:none;" d="M277 70L277 71L288 74L277 70z"/>
<path style="fill:#b3d286; stroke:none;" d="M429 70L430 71L429 70M489 70L490 71L489 70M502 70L503 71L502 70M547 70L548 71L547 70z"/>
<path style="fill:#d3edaf; stroke:none;" d="M605 70L606 71L605 70z"/>
<path style="fill:#b3d286; stroke:none;" d="M640 70L641 71L640 70z"/>
<path style="fill:#d3edaf; stroke:none;" d="M12 71L13 72L12 71z"/>
<path style="fill:#b3d286; stroke:none;" d="M105 71L106 72L105 71z"/>
<path style="fill:#d3edaf; stroke:none;" d="M106 71L107 72L106 71M133 71L134 72L133 71z"/>
<path style="fill:#b3d286; stroke:none;" d="M134.667 71.3333L135.333 71.6667L134.667 71.3333z"/>
<path style="fill:#9bbd6b; stroke:none;" d="M136 71L136 72L139 72L136 71M271 72L271 73L275 72L271 72z"/>
<path style="fill:#b3d286; stroke:none;" d="M275.667 71.3333L276.333 71.6667L275.667 71.3333z"/>
<path style="fill:#d3edaf; stroke:none;" d="M277.667 71.3333L278.333 71.6667L277.667 71.3333z"/>
<path style="fill:#b3d286; stroke:none;" d="M279.667 71.3333L280.333 71.6667L279.667 71.3333z"/>
<path style="fill:#d3edaf; stroke:none;" d="M302.333 71.6667L302.667 72.3333L302.333 71.6667z"/>
<path style="fill:#b3d286; stroke:none;" d="M312 71L313 72L312 71z"/>
<path style="fill:#d3edaf; stroke:none;" d="M346 71L347 72L346 71z"/>
<path style="fill:#9bbd6b; stroke:none;" d="M358 119C361.112 116.281 360 110.89 360 107C360 96.2088 355.363 75.2516 369 72C363.834 70.3241 359.665 75.0489 359.109 80.0008C357.668 92.8326 361.011 106.354 358 119z"/>
<path style="fill:#b3d286; stroke:none;" d="M369.667 71.3333L370.333 71.6667L369.667 71.3333z"/>
<path style="fill:#9bbd6b; stroke:none;" d="M371 71L371 72C375.508 72.9123 377.856 74.9671 380 79C381.057 73.7526 375.394 71.4894 371 71M396 77L397 77L405 72C400.607 70.3587 397.846 73.1688 396 77z"/>
<path style="fill:#b3d286; stroke:none;" d="M405.667 71.3333L406.333 71.6667L405.667 71.3333z"/>
<path style="fill:#9bbd6b; stroke:none;" d="M407 71L407 72L416 78C416.7 72.9194 411.15 71.4281 407 71M453 87L454 87C455.323 71.9614 472.686 67.3791 478 83C480.055 75.4817 470.629 69.9565 464 71.3981C456.401 73.0509 453.323 79.9557 453 87z"/>
<path style="fill:#d3edaf; stroke:none;" d="M490 71L491 72L490 71M501 71L502 72L501 71z"/>
<path style="fill:#9bbd6b; stroke:none;" d="M513 82L514 82C517.233 72.5165 528.007 68.8792 534.297 78.0185C538.031 83.4431 537 90.7672 537 97C539.839 90.2336 538.419 79.2892 532.892 74.2284C525.115 67.1074 514.688 72.6873 513 82z"/>
<path style="fill:#d3edaf; stroke:none;" d="M559 71L560 72L559 71z"/>
<path style="fill:#9bbd6b; stroke:none;" d="M570 96L571 96C571 91.1258 570.332 85.6299 572.148 81C575.735 71.8572 586.15 69.5332 591.867 78.0432C595.511 83.4679 595 89.7778 595 96C601.738 79.9428 580.445 59.3606 571.225 79.0147C568.622 84.5626 569.541 90.1769 570 96z"/>
<path style="fill:#d3edaf; stroke:none;" d="M639 71L640 72L639 71z"/>
<path style="fill:#b3d286; stroke:none;" d="M657 71L658 72L657 71M12 72L13 73L12 72M103 72L104 73L103 72z"/>
<path style="fill:#d3edaf; stroke:none;" d="M129 72L130 73L129 72z"/>
<path style="fill:#b3d286; stroke:none;" d="M130.667 72.3333L131.333 72.6667L130.667 72.3333z"/>
<path style="fill:#9bbd6b; stroke:none;" d="M132 72L132 73L136 73L132 72z"/>
<path style="fill:#d3edaf; stroke:none;" d="M272.667 72.3333L273.333 72.6667L272.667 72.3333M283 72L284 73L283 72z"/>
<path style="fill:#b3d286; stroke:none;" d="M284 72L285 73L284 72z"/>
<path style="fill:#d3edaf; stroke:none;" d="M311 72L312 73L311 72z"/>
<path style="fill:#b3d286; stroke:none;" d="M365 72L366 73L365 72z"/>
<path style="fill:#d3edaf; stroke:none;" d="M366 72L367 73L366 72M373 72L374 73L373 72z"/>
<path style="fill:#b3d286; stroke:none;" d="M374 72L375 73L374 72M401 72L402 73L401 72z"/>
<path style="fill:#d3edaf; stroke:none;" d="M402.667 72.3333L403.333 72.6667L402.667 72.3333M409 72L410 73L409 72z"/>
<path style="fill:#b3d286; stroke:none;" d="M410 72L411 73L410 72z"/>
<path style="fill:#d3edaf; stroke:none;" d="M430 72L431 73L430 72z"/>
<path style="fill:#b3d286; stroke:none;" d="M464 72L464 73L468 73L464 72M490 72L491 73L490 72M501 72L502 73L501 72M522.667 72.3333L523.333 72.6667L522.667 72.3333z"/>
<path style="fill:#d3edaf; stroke:none;" d="M524 72L524 73L527 73L524 72z"/>
<path style="fill:#b3d286; stroke:none;" d="M527 72L528 73L527 72M548 72L549 73L548 72M580 72L581 73L580 72z"/>
<path style="fill:#d3edaf; stroke:none;" d="M581 72L581 73L585 73L581 72z"/>
<path style="fill:#b3d286; stroke:none;" d="M585 72L586 73L585 72z"/>
<path style="fill:#d3edaf; stroke:none;" d="M606 72L607 73L606 72M638 72L639 73L638 72M657 72L658 73L657 72z"/>
<path style="fill:#b3d286; stroke:none;" d="M100 73L101 74L100 73z"/>
<path style="fill:#d3edaf; stroke:none;" d="M101 73L102 74L101 73M126 73L127 74L126 73z"/>
<path style="fill:#9bbd6b; stroke:none;" d="M118 79L119 79L132 74C127.78 72.0385 119.373 74.3015 118 79M210 73L210 74C215.024 74 233.241 71.2711 235.863 76.3179C241.231 86.6486 214.244 85 210 85L210 86C222.452 86 238.85 89.8252 239 73L210 73z"/>
<path style="fill:#d3edaf; stroke:none;" d="M254 73L255 74L254 73z"/>
<path style="fill:#9bbd6b; stroke:none;" d="M267 74L267 75L271 74L267 74z"/>
<path style="fill:#d3edaf; stroke:none;" d="M286 73L287 74L286 73z"/>
<path style="fill:#b3d286; stroke:none;" d="M302 73L302 76L303 76L302 73z"/>
<path style="fill:#9bbd6b; stroke:none;" d="M339 73L333 75L333 76C335.535 75.9896 340.356 76.598 339 73z"/>
<path style="fill:#d3edaf; stroke:none;" d="M345 73L346 74L345 73M364 73L365 74L364 73M375 73L376 74L375 73z"/>
<path style="fill:#b3d286; stroke:none;" d="M376 73L377 74L376 73z"/>
<path style="fill:#d3edaf; stroke:none;" d="M400.667 73.3333L401.333 73.6667L400.667 73.3333z"/>
<path style="fill:#b3d286; stroke:none;" d="M412 73L413 74L412 73M430 73L431 74L430 73M461 73L462 74L461 73z"/>
<path style="fill:#d3edaf; stroke:none;" d="M462.667 73.3333L463.333 73.6667L462.667 73.3333z"/>
<path style="fill:#fefffc; stroke:none;" d="M464.015 73.537C448.024 77.3004 451.218 111.881 469.996 106.427C483.577 102.483 481.066 69.5242 464.015 73.537z"/>
<path style="fill:#d3edaf; stroke:none;" d="M470 73L471 74L470 73M491 73L492 74L491 73M500 73L501 74L500 73M520.667 73.3333L521.333 73.6667L520.667 73.3333z"/>
<path style="fill:#fefffc; stroke:none;" d="M522.001 73.5733C507.937 77.5605 511.418 112.61 527.985 107.282C542.183 102.716 539.522 68.6059 522.001 73.5733z"/>
<path style="fill:#d3edaf; stroke:none;" d="M529 73L530 74L529 73z"/>
<path style="fill:#b3d286; stroke:none;" d="M530 73L531 74L530 73z"/>
<path style="fill:#d3edaf; stroke:none;" d="M558 73L559 74L558 73z"/>
<path style="fill:#b3d286; stroke:none;" d="M577 73L578 74L577 73z"/>
<path style="fill:#d3edaf; stroke:none;" d="M578 73L579 74L578 73z"/>
<path style="fill:#fefffc; stroke:none;" d="M579.015 73.7029C565.301 78.4601 569.723 113.255 585.985 107.103C599.938 101.824 596.884 67.5049 579.015 73.7029z"/>
<path style="fill:#d3edaf; stroke:none;" d="M587 73L588 74L587 73M656 73L657 74L656 73M11 74L12 75L11 74z"/>
<path style="fill:#b3d286; stroke:none;" d="M98 74L99 75L98 74z"/>
<path style="fill:#d3edaf; stroke:none;" d="M122 74L123 75L122 74z"/>
<path style="fill:#b3d286; stroke:none;" d="M123 74L124 75L123 74M154 74L155 75L154 74M254 74L269 76L269 75L254 74z"/>
<path style="fill:#9bbd6b; stroke:none;" d="M258 74L259 75L258 74M260 74L260 75L263 75L260 74z"/>
<path style="fill:#d3edaf; stroke:none;" d="M270.667 74.3333L271.333 74.6667L270.667 74.3333z"/>
<path style="fill:#b3d286; stroke:none;" d="M287 74L288 75L287 74z"/>
<path style="fill:#d3edaf; stroke:none;" d="M310 74L311 75L310 74z"/>
<path style="fill:#b3d286; stroke:none;" d="M345.333 74.6667L345.667 75.3333L345.333 74.6667M362 74L363 75L362 74z"/>
<path style="fill:#d3edaf; stroke:none;" d="M377 74L378 75L377 74z"/>
<path style="fill:#b3d286; stroke:none;" d="M398 74L399 75L398 74z"/>
<path style="fill:#d3edaf; stroke:none;" d="M399 74L400 75L399 74M413 74L414 75L413 74z"/>
<path style="fill:#b3d286; stroke:none;" d="M459 74L460 75L459 74z"/>
<path style="fill:#d3edaf; stroke:none;" d="M460 74L461 75L460 74M472 74L473 75L472 74z"/>
<path style="fill:#b3d286; stroke:none;" d="M491 74L492 75L491 74M500 74L501 75L500 74z"/>
<path style="fill:#d3edaf; stroke:none;" d="M518 74L519 75L518 74M531 74L532 75L531 74z"/>
<path style="fill:#b3d286; stroke:none;" d="M549 74L550 75L549 74M558 74L559 75L558 74z"/>
<path style="fill:#d3edaf; stroke:none;" d="M576 74L577 75L576 74z"/>
<path style="fill:#b3d286; stroke:none;" d="M589 74L590 75L589 74z"/>
<path style="fill:#d3edaf; stroke:none;" d="M607 74L608 75L607 74M636 74L637 75L636 74z"/>
<path style="fill:#b3d286; stroke:none;" d="M11 75L12 76L11 75z"/>
<path style="fill:#d3edaf; stroke:none;" d="M96 75L97 76L96 75M118.667 75.3333L119.333 75.6667L118.667 75.3333z"/>
<path style="fill:#b3d286; stroke:none;" d="M120 75L121 76L120 75z"/>
<path style="fill:#d3edaf; stroke:none;" d="M154.333 75.6667L154.667 76.3333L154.333 75.6667M269 75L270 76L269 75M287 75L288 76L287 75z"/>
<path style="fill:#b3d286; stroke:none;" d="M361 75L362 76L361 75z"/>
<path style="fill:#d3edaf; stroke:none;" d="M378 75L379 76L378 75M414 75L415 76L414 75M431.333 75.6667L431.667 76.3333L431.333 75.6667M458 75L456 79L458 75M517 75L518 76L517 75M532 75L533 76L532 75M550.333 75.6667L550.667 76.3333L550.333 75.6667M557 75L558 76L557 75z"/>
<path style="fill:#9bbd6b; stroke:none;" d="M558 75L557 81L558 81L558 75z"/>
<path style="fill:#d3edaf; stroke:none;" d="M575 75L576 76L575 75z"/>
<path style="fill:#b3d286; stroke:none;" d="M590 75L591 76L590 75M636 75L637 76L636 75z"/>
<path style="fill:#d3edaf; stroke:none;" d="M654 75L655 76L654 75z"/>
<path style="fill:#b3d286; stroke:none;" d="M93 76L94 77L93 76z"/>
<path style="fill:#d3edaf; stroke:none;" d="M94 76L95 77L94 76z"/>
<path style="fill:#9bbd6b; stroke:none;" d="M288 76L286 81L288 76z"/>
<path style="fill:#d3edaf; stroke:none;" d="M309 76L310 77L309 76z"/>
<path style="fill:#9bbd6b; stroke:none;" d="M323 83L324 83L331 77C326.637 75.8578 324.124 79.0924 323 83z"/>
<path style="fill:#b3d286; stroke:none;" d="M331.667 76.3333L332.333 76.6667L331.667 76.3333z"/>
<path style="fill:#d3edaf; stroke:none;" d="M333.667 76.3333L334.333 76.6667L333.667 76.3333z"/>
<path style="fill:#b3d286; stroke:none;" d="M335 76L336 77L335 76z"/>
<path style="fill:#d3edaf; stroke:none;" d="M336.667 76.3333L337.333 76.6667L336.667 76.3333z"/>
<path style="fill:#b3d286; stroke:none;" d="M338 76L339 77L338 76z"/>
<path style="fill:#d3edaf; stroke:none;" d="M339.667 76.3333L340.333 76.6667L339.667 76.3333M361 76L360 80L361 80L361 76M398 76L399 77L398 76z"/>
<path style="fill:#b3d286; stroke:none;" d="M415 76L416 77L415 76M457 76L458 77L457 76z"/>
<path style="fill:#d3edaf; stroke:none;" d="M492 76L493 77L492 76M499 76L500 77L499 76M516 76L517 77L516 76z"/>
<path style="fill:#b3d286; stroke:none;" d="M533 76L534 77L533 76M557 76L558 77L557 76z"/>
<path style="fill:#d3edaf; stroke:none;" d="M608.333 76.6667L608.667 77.3333L608.333 76.6667z"/>
<path style="fill:#b3d286; stroke:none;" d="M635 76L636 77L635 76z"/>
<path style="fill:#d3edaf; stroke:none;" d="M653 76L654 77L653 76M10.3333 77.6667L10.6667 78.3333L10.3333 77.6667z"/>
<path style="fill:#b3d286; stroke:none;" d="M91 77L92 78L91 77z"/>
<path style="fill:#d3edaf; stroke:none;" d="M92 77L93 78L92 77z"/>
<path style="fill:#b3d286; stroke:none;" d="M302 77L302 101L303 101L302 77M328 77L329 78L328 77z"/>
<path style="fill:#d3edaf; stroke:none;" d="M329 77L330 78L329 77M344 77L344 80L345 80L344 77z"/>
<path style="fill:#b3d286; stroke:none;" d="M360 77L361 78L360 77z"/>
<path style="fill:#d3edaf; stroke:none;" d="M379 77L380 78L379 77z"/>
<path style="fill:#b3d286; stroke:none;" d="M381 77L382 78L381 77M396 77L397 78L396 77M431.333 77.6667L431.667 78.3333L431.333 77.6667M456 77L457 78L456 77z"/>
<path style="fill:#d3edaf; stroke:none;" d="M475 77L476 78L475 77z"/>
<path style="fill:#b3d286; stroke:none;" d="M492 77L493 78L492 77M499 77L500 78L499 77M515 77L516 78L515 77M534 77L535 78L534 77M550 77L551 78L550 77z"/>
<path style="fill:#d3edaf; stroke:none;" d="M573 77L574 78L573 77z"/>
<path style="fill:#b3d286; stroke:none;" d="M634 77L635 78L634 77z"/>
<path style="fill:#d3edaf; stroke:none;" d="M652 77L653 78L652 77z"/>
<path style="fill:#b3d286; stroke:none;" d="M89 78L90 79L89 78z"/>
<path style="fill:#d3edaf; stroke:none;" d="M90 78L91 79L90 78M117 78L118 79L117 78z"/>
<path style="fill:#b3d286; stroke:none;" d="M153 78L154 79L153 78M287 78L288 79L287 78z"/>
<path style="fill:#d3edaf; stroke:none;" d="M327 78L328 79L327 78z"/>
<path style="fill:#9bbd6b; stroke:none;" d="M395 78C395 87.7662 399.187 110.962 392 118L392 119L396 119C396 107.304 399.511 88.7499 395 78z"/>
<path style="fill:#d3edaf; stroke:none;" d="M396.333 78.6667L396.667 79.3333L396.333 78.6667z"/>
<path style="fill:#b3d286; stroke:none;" d="M416 78L417 79L416 78M476 78L477 79L476 78z"/>
<path style="fill:#d3edaf; stroke:none;" d="M534 78L535 79L534 78M556.333 78.6667L556.667 79.3333L556.333 78.6667M592 78L593 79L592 78z"/>
<path style="fill:#b3d286; stroke:none;" d="M608 78L609 79L608 78M633 78L634 79L633 78z"/>
<path style="fill:#d3edaf; stroke:none;" d="M651 78L652 79L651 78z"/>
<path style="fill:#b3d286; stroke:none;" d="M10.3333 79.6667L10.6667 80.3333L10.3333 79.6667z"/>
<path style="fill:#9bbd6b; stroke:none;" d="M86 79L87 80L86 79z"/>
<path style="fill:#b3d286; stroke:none;" d="M87 79L88 80L87 79z"/>
<path style="fill:#d3edaf; stroke:none;" d="M88 79L89 80L88 79z"/>
<path style="fill:#b3d286; stroke:none;" d="M108 79L109 80L108 79z"/>
<path style="fill:#9bbd6b; stroke:none;" d="M109 79L88 89L88 90L108 82L108 86L109 86L109 79z"/>
<path style="fill:#b3d286; stroke:none;" d="M110 79L111 80L110 79M117.333 79.6667L117.667 80.3333L117.333 79.6667z"/>
<path style="fill:#9bbd6b; stroke:none;" d="M152 79L144 100L145 100C148.101 94.6667 153.846 85.2434 152 79z"/>
<path style="fill:#d3edaf; stroke:none;" d="M153.333 79.6667L153.667 80.3333L153.333 79.6667M286 79L287 80L286 79z"/>
<path style="fill:#b3d286; stroke:none;" d="M308 79L309 80L308 79M380 79L380 82L381 82L380 79z"/>
<path style="fill:#d3edaf; stroke:none;" d="M416 79L416 115L417 115C417 104.613 420.011 88.5596 416 79z"/>
<path style="fill:#9bbd6b; stroke:none;" d="M431 79C431 88.7948 434.953 110.142 429 118L429 119C433.221 118.096 432 113.654 432 110C432 101.883 434.975 85.8992 431 79z"/>
<path style="fill:#b3d286; stroke:none;" d="M455 79L456 80L455 79z"/>
<path style="fill:#d3edaf; stroke:none;" d="M493.333 79.6667L493.667 80.3333L493.333 79.6667z"/>
<path style="fill:#b3d286; stroke:none;" d="M514 79L515 80L514 79M535 79L536 80L535 79z"/>
<path style="fill:#d3edaf; stroke:none;" d="M551.333 79.6667L551.667 80.3333L551.333 79.6667z"/>
<path style="fill:#b3d286; stroke:none;" d="M572 79L573 80L572 79M650 79L651 80L650 79z"/>
<path style="fill:#9bbd6b; stroke:none;" d="M84 80C75.6133 84.895 61.5533 89.966 57 99L85 81L84 80z"/>
<path style="fill:#b3d286; stroke:none;" d="M85 80L86 81L85 80z"/>
<path style="fill:#d3edaf; stroke:none;" d="M86 80L87 81L86 80M105 80L106 81L105 80z"/>
<path style="fill:#b3d286; stroke:none;" d="M238 80L239 81L238 80z"/>
<path style="fill:#d3edaf; stroke:none;" d="M284 80L285 81L284 80z"/>
<path style="fill:#b3d286; stroke:none;" d="M285 80L286 81L285 80z"/>
<path style="fill:#d3edaf; stroke:none;" d="M325 80L326 81L325 80z"/>
<path style="fill:#b3d286; stroke:none;" d="M344 80L344 109L345.603 118.972L360 120L360 119L345 119C345 107.828 348.311 90.274 344 80z"/>
<path style="fill:#9bbd6b; stroke:none;" d="M381 80L381 109C381 112.77 379.584 118.054 384 119L384 118C376.74 108.417 385.574 90.9006 381 80z"/>
<path style="fill:#d3edaf; stroke:none;" d="M455 80L456 81L455 80z"/>
<path style="fill:#b3d286; stroke:none;" d="M477 80L478 81L477 80z"/>
<path style="fill:#d3edaf; stroke:none;" d="M498.333 80.6667L498.667 81.3333L498.333 80.6667M514.333 80.6667L514.667 81.3333L514.333 80.6667M535 80L536 81L535 80z"/>
<path style="fill:#b3d286; stroke:none;" d="M556.333 80.6667L556.667 81.3333L556.333 80.6667z"/>
<path style="fill:#d3edaf; stroke:none;" d="M593.333 80.6667L593.667 81.3333L593.333 80.6667M609.333 80.6667L609.667 81.3333L609.333 80.6667z"/>
<path style="fill:#b3d286; stroke:none;" d="M649 80L650 81L649 80z"/>
<path style="fill:#9bbd6b; stroke:none;" d="M10 81L12 110L13 110L10 81z"/>
<path style="fill:#d3edaf; stroke:none;" d="M84 81L85 82L84 81M103 81L104 82L103 81z"/>
<path style="fill:#9bbd6b; stroke:none;" d="M117 81L113 96L114 96C116.259 91.6912 118.713 85.7788 117 81z"/>
<path style="fill:#d3edaf; stroke:none;" d="M282 81L283 82L282 81z"/>
<path style="fill:#9bbd6b; stroke:none;" d="M274 121L274 120C268.841 118.429 263.548 117.982 259.189 114.363C251.849 108.267 252.672 95.2325 260.044 89.6381C267.428 84.0348 276.865 85.4337 285 82C267.709 78.3531 238.989 98.4923 258.108 115.725C262.534 119.715 268.437 119.964 274 121z"/>
<path style="fill:#d3edaf; stroke:none;" d="M324 81L325 82L324 81M477 81L478 82L477 81z"/>
<path style="fill:#b3d286; stroke:none;" d="M493 81L494 82L493 81M551 81L552 82L551 81M630 81L631 82L630 81M648 81L649 82L648 81z"/>
<path style="fill:#d3edaf; stroke:none;" d="M82 82L83 83L82 82M100 82L101 83L100 82z"/>
<path style="fill:#b3d286; stroke:none;" d="M101 82L102 83L101 82z"/>
<path style="fill:#8dc542; stroke:none;" d="M37 136C47.2421 139.945 63.3041 143.355 74 139.16C91.0163 132.487 107.097 99.413 108 82C87.7612 84.1959 63.5156 104.316 50.0008 118.41C45.0748 123.548 38.9154 128.969 37 136z"/>
<path style="fill:#b3d286; stroke:none;" d="M109 82L110 83L109 82z"/>
<path style="fill:#d3edaf; stroke:none;" d="M116.333 82.6667L116.667 83.3333L116.333 82.6667z"/>
<path style="fill:#b3d286; stroke:none;" d="M152 82L153 83L152 82M237 82L238 83L237 82z"/>
<path style="fill:#d3edaf; stroke:none;" d="M275 82L275 83L278 83L275 82z"/>
<path style="fill:#b3d286; stroke:none;" d="M278.667 82.3333L279.333 82.6667L278.667 82.3333z"/>
<path style="fill:#9bbd6b; stroke:none;" d="M301 82C301 91.0097 302.709 102.118 297.298 109.985C294.595 113.914 290.117 115.575 287 119C301.422 114.725 306.533 95.1849 301 82z"/>
<path style="fill:#d3edaf; stroke:none;" d="M307 82L307 85L308 85L307 82M380 82L380 120L381 120C381 109.089 384.211 92.036 380 82z"/>
<path style="fill:#9bbd6b; stroke:none;" d="M439 82L439 86L440 86L439 82z"/>
<path style="fill:#b3d286; stroke:none;" d="M454 82L455 83L454 82z"/>
<path style="fill:#9bbd6b; stroke:none;" d="M493 82C493 102.904 487.272 120.18 463 118.96C457.945 118.706 453.868 115.928 449 115L449 116C469.782 125.719 493.355 118.651 493.985 93C494.076 89.3279 494.426 85.3993 493 82z"/>
<path style="fill:#b3d286; stroke:none;" d="M498 82L499 83L498 82M513 82L514 83L513 82M536 82L537 83L536 82z"/>
<path style="fill:#9bbd6b; stroke:none;" d="M551 82L551 98L552 98L551 82M556 82L557 102L558 102L556 82z"/>
<path style="fill:#b3d286; stroke:none;" d="M571 82L572 83L571 82M609 82L610 83L609 82M647 82L648 83L647 82M80 83L81 84L80 83z"/>
<path style="fill:#d3edaf; stroke:none;" d="M98 83L99 84L98 83M109.333 83.6667L109.667 84.3333L109.333 83.6667M152 83L153 84L152 83M269.667 83.3333L270.333 83.6667L269.667 83.3333z"/>
<path style="fill:#b3d286; stroke:none;" d="M271 83L271 84L274 84L271 83M323 83L324 84L323 83z"/>
<path style="fill:#9bbd6b; stroke:none;" d="M345.333 83.6667L345.667 84.3333L345.333 83.6667z"/>
<path style="fill:#d3edaf; stroke:none;" d="M432 83L432 120L433 120C433 109.351 436.111 92.7978 432 83M454.333 83.6667L454.667 84.3333L454.333 83.6667z"/>
<path style="fill:#b3d286; stroke:none;" d="M478.333 83.6667L478.667 84.3333L478.333 83.6667z"/>
<path style="fill:#9bbd6b; stroke:none;" d="M498 83C498 99.898 501.236 119.049 522 120L522 119C499.125 116.988 504.211 97.8019 498 83M512 83L513 100L514 100L512 83z"/>
<path style="fill:#d3edaf; stroke:none;" d="M513 83L513 88L514 88L513 83M536 83L536 86L537 86L536 83M571.333 83.6667L571.667 84.3333L571.333 83.6667z"/>
<path style="fill:#b3d286; stroke:none;" d="M594 83L595 84L594 83z"/>
<path style="fill:#d3edaf; stroke:none;" d="M647 83L648 84L647 83M9.33333 84.6667L9.66667 85.3333L9.33333 84.6667z"/>
<path style="fill:#b3d286; stroke:none;" d="M78 84L79 85L78 84M96 84L97 85L96 84M116 84L117 85L116 84M235 84L236 85L235 84z"/>
<path style="fill:#d3edaf; stroke:none;" d="M265.667 84.3333L266.333 84.6667L265.667 84.3333z"/>
<path style="fill:#b3d286; stroke:none;" d="M267 84L268 85L267 84z"/>
<path style="fill:#9bbd6b; stroke:none;" d="M322 84C320.867 93.5944 326.038 110.489 319 118L319 119L323 119L322 84z"/>
<path style="fill:#d3edaf; stroke:none;" d="M323.333 84.6667L323.667 85.3333L323.333 84.6667M552 84L552 96L553 96L552 84M555 84L555 95L556 95L555 84M594 84L594 89L595 89L594 84z"/>
<path style="fill:#b3d286; stroke:none;" d="M647 84L648 85L647 84z"/>
<path style="fill:#d3edaf; stroke:none;" d="M94 85L95 86L94 85z"/>
<path style="fill:#b3d286; stroke:none;" d="M151 85L152 86L151 85M233 85L234 86L233 85z"/>
<path style="fill:#d3edaf; stroke:none;" d="M234 85L235 86L234 85M263 85L264 86L263 85z"/>
<path style="fill:#b3d286; stroke:none;" d="M307 85L307 89L308 89L307 85z"/>
<path style="fill:#d3edaf; stroke:none;" d="M478 85L478 95L479 95L478 85z"/>
<path style="fill:#9bbd6b; stroke:none;" d="M479 85L479 96L480 96L479 85z"/>
<path style="fill:#d3edaf; stroke:none;" d="M494 85L494 96L495 96L494 85z"/>
<path style="fill:#9bbd6b; stroke:none;" d="M647 85L650 89L647 85z"/>
<path style="fill:#d3edaf; stroke:none;" d="M648 85L649 86L648 85z"/>
<path style="fill:#b3d286; stroke:none;" d="M9 86L9 96L10 96L9 86z"/>
<path style="fill:#d3edaf; stroke:none;" d="M75 86L76 87L75 86M92 86L93 87L92 86z"/>
<path style="fill:#b3d286; stroke:none;" d="M108 86L109 87L108 86z"/>
<path style="fill:#d3edaf; stroke:none;" d="M115 86L116 87L115 86M151 86L152 87L151 86z"/>
<path style="fill:#9bbd6b; stroke:none;" d="M208 86L208 120L209 120L208 86z"/>
<path style="fill:#d3edaf; stroke:none;" d="M209 86L209 119L210 119L209 86M261 86L262 87L261 86z"/>
<path style="fill:#9bbd6b; stroke:none;" d="M345 86L346 87L345 86z"/>
<path style="fill:#b3d286; stroke:none;" d="M73 87L74 88L73 87z"/>
<path style="fill:#d3edaf; stroke:none;" d="M90 87L91 88L90 87z"/>
<path style="fill:#9bbd6b; stroke:none;" d="M107 87L104 98L105 98L107 87z"/>
<path style="fill:#d3edaf; stroke:none;" d="M108 87L109 88L108 87z"/>
<path style="fill:#b3d286; stroke:none;" d="M115 87L116 88L115 87z"/>
<path style="fill:#d3edaf; stroke:none;" d="M259 87L260 88L259 87z"/>
<path style="fill:#9bbd6b; stroke:none;" d="M439 87L440 88L439 87z"/>
<path style="fill:#b3d286; stroke:none;" d="M453 87L453 92L454 92L453 87z"/>
<path style="fill:#d3edaf; stroke:none;" d="M497 87L497 92L498 92L497 87M610 87L610 93L611 93L610 87M649 87L650 88L649 87M72 88L73 89L72 88M88 88L89 89L88 88z"/>
<path style="fill:#b3d286; stroke:none;" d="M150 88L151 89L150 88M258 88L259 89L258 88z"/>
<path style="fill:#9bbd6b; stroke:none;" d="M417 88C417 96.2986 413.113 116.064 423 119L423 118C413.363 110.837 421.017 97.5741 417 88z"/>
<path style="fill:#b3d286; stroke:none;" d="M70 89L71 90L70 89z"/>
<path style="fill:#d3edaf; stroke:none;" d="M86 89L87 90L86 89z"/>
<path style="fill:#b3d286; stroke:none;" d="M87 89L88 90L87 89M107 89L108 90L107 89z"/>
<path style="fill:#d3edaf; stroke:none;" d="M150 89L151 90L150 89z"/>
<path style="fill:#9bbd6b; stroke:none;" d="M285 91L289 91L285 91M307 89L307 120L310 119L307 89z"/>
<path style="fill:#b3d286; stroke:none;" d="M650 89L651 90L650 89z"/>
<path style="fill:#d3edaf; stroke:none;" d="M69 90L70 91L69 90M84 90L85 91L84 90z"/>
<path style="fill:#9bbd6b; stroke:none;" d="M34 136L48 140L48 139L37 136C45.9289 115.961 69.5141 102.534 87 91C81.7364 90.5051 75.2135 96.2803 71 99.2052C56.8283 109.043 43.5363 121.569 34 136z"/>
<path style="fill:#d3edaf; stroke:none;" d="M107 90L108 91L107 90M114 90L115 91L114 90z"/>
<path style="fill:#b3d286; stroke:none;" d="M149 90L150 91L149 90z"/>
<path style="fill:#d3edaf; stroke:none;" d="M255 90L256 91L255 90z"/>
<path style="fill:#b3d286; stroke:none;" d="M256 90L257 91L256 90z"/>
<path style="fill:#d3edaf; stroke:none;" d="M287 90L288 91L287 90M513 90L513 95L514 95L513 90z"/>
<path style="fill:#9bbd6b; stroke:none;" d="M650 90L661.778 112L667 119C664.029 109.615 656.813 97.1195 650 90z"/>
<path style="fill:#d3edaf; stroke:none;" d="M651 90L652 91L651 90z"/>
<path style="fill:#b3d286; stroke:none;" d="M67 91L68 92L67 91M83 91L84 92L83 91M114 91L115 92L114 91z"/>
<path style="fill:#d3edaf; stroke:none;" d="M149 91L150 92L149 91z"/>
<path style="fill:#b3d286; stroke:none;" d="M255 91L256 92L255 91z"/>
<path style="fill:#9bbd6b; stroke:none;" d="M283 91L271 109L272 109L281 100L278 109L289 97L289 96L283 98L283 91z"/>
<path style="fill:#d3edaf; stroke:none;" d="M284 91L283 95L284 95L286 91L284 91z"/>
<path style="fill:#fefffc; stroke:none;" d="M284 96L288 96L288 91L284 96z"/>
<path style="fill:#b3d286; stroke:none;" d="M288 91L288 96L289 96L288 91z"/>
<path style="fill:#d3edaf; stroke:none;" d="M594 91L594 95L595 95L594 91z"/>
<path style="fill:#b3d286; stroke:none;" d="M651 91L652 92L651 91z"/>
<path style="fill:#d3edaf; stroke:none;" d="M66 92L67 93L66 92M81 92L82 93L81 92z"/>
<path style="fill:#b3d286; stroke:none;" d="M106 92L107 93L106 92z"/>
<path style="fill:#d3edaf; stroke:none;" d="M254 92L255 93L254 92z"/>
<path style="fill:#9bbd6b; stroke:none;" d="M273 93L273 94L280 93L273 93z"/>
<path style="fill:#b3d286; stroke:none;" d="M280.667 92.3333L281.333 92.6667L280.667 92.3333z"/>
<path style="fill:#9bbd6b; stroke:none;" d="M453 92C453.154 109.23 475.468 116.499 479 97L478 97C475.354 105.903 465.785 111.784 458.225 103.867C454.924 100.41 454.835 96.0797 453 92z"/>
<path style="fill:#d3edaf; stroke:none;" d="M652 92L653 93L652 92z"/>
<path style="fill:#b3d286; stroke:none;" d="M64 93L65 94L64 93z"/>
<path style="fill:#d3edaf; stroke:none;" d="M79 93L80 94L79 93M106 93L107 94L106 93M113 93L114 94L113 93M148 93L149 94L148 93z"/>
<path style="fill:#b3d286; stroke:none;" d="M254 93L255 94L254 93M276 93L277 94L276 93z"/>
<path style="fill:#d3edaf; stroke:none;" d="M277 93L277 94L281 94L280 99L281 99L282 93L277 93M571 93L571 97L572 97L571 93z"/>
<path style="fill:#b3d286; stroke:none;" d="M60 94L61 95L60 94z"/>
<path style="fill:#d3edaf; stroke:none;" d="M63 94L64 95L63 94M77 94L78 95L77 94z"/>
<path style="fill:#b3d286; stroke:none;" d="M78 94L79 95L78 94M113 94L114 95L113 94z"/>
<path style="fill:#d3edaf; stroke:none;" d="M253 94L254 95L253 94z"/>
<path style="fill:#9bbd6b; stroke:none;" d="M271 94L272 95L271 94z"/>
<path style="fill:#b3d286; stroke:none;" d="M272 94L273 95L272 94z"/>
<path style="fill:#d3edaf; stroke:none;" d="M273 94L274 95L273 94z"/>
<path style="fill:#fefffc; stroke:none;" d="M269 107C274.06 104.578 280.075 99.7351 281 94C271.953 94.0809 266.734 97.4508 269 107z"/>
<path style="fill:#d3edaf; stroke:none;" d="M536 94L536 97L537 97L536 94z"/>
<path style="fill:#9bbd6b; stroke:none;" d="M630 96L633 95L630 96z"/>
<path style="fill:#d3edaf; stroke:none;" d="M633.333 94.6667L633.667 95.3333L633.333 94.6667z"/>
<path style="fill:#9bbd6b; stroke:none;" d="M634 94L634 95L644 110L645 110C643.346 104.377 639.91 95.8483 634 94z"/>
<path style="fill:#b3d286; stroke:none;" d="M653 94L654 95L653 94z"/>
<path style="fill:#d3edaf; stroke:none;" d="M76 95L77 96L76 95z"/>
<path style="fill:#b3d286; stroke:none;" d="M105 95L106 96L105 95z"/>
<path style="fill:#d3edaf; stroke:none;" d="M147 95L148 96L147 95z"/>
<path style="fill:#b3d286; stroke:none;" d="M253.333 95.6667L253.667 96.3333L253.333 95.6667z"/>
<path style="fill:#9bbd6b; stroke:none;" d="M269 95L267 99L268 99L269 95z"/>
<path style="fill:#b3d286; stroke:none;" d="M270 95L271 96L270 95z"/>
<path style="fill:#d3edaf; stroke:none;" d="M271 95L272 96L271 95z"/>
<path style="fill:#b3d286; stroke:none;" d="M283 95L284 96L283 95z"/>
<path style="fill:#9bbd6b; stroke:none;" d="M439 95C439.065 102.903 440.792 110.676 448 115L439 95z"/>
<path style="fill:#d3edaf; stroke:none;" d="M454.333 95.6667L454.667 96.3333L454.333 95.6667z"/>
<path style="fill:#b3d286; stroke:none;" d="M478.333 95.6667L478.667 96.3333L478.333 95.6667M513.333 95.6667L513.667 96.3333L513.333 95.6667M594.333 95.6667L594.667 96.3333L594.333 95.6667z"/>
<path style="fill:#d3edaf; stroke:none;" d="M631 95L632 96L631 95z"/>
<path style="fill:#b3d286; stroke:none;" d="M635 95L636 96L635 95z"/>
<path style="fill:#d3edaf; stroke:none;" d="M9 96L9 100L10 100L9 96z"/>
<path style="fill:#b3d286; stroke:none;" d="M60 96L61 97L60 96z"/>
<path style="fill:#d3edaf; stroke:none;" d="M74 96L75 97L74 96z"/>
<path style="fill:#b3d286; stroke:none;" d="M75 96L76 97L75 96z"/>
<path style="fill:#d3edaf; stroke:none;" d="M105 96L106 97L105 96M112 96L113 97L112 96M269 96L270 97L269 96M283 96L283 97L287 97L283 96z"/>
<path style="fill:#b3d286; stroke:none;" d="M287 96L288 97L287 96M438 96L439 97L438 96M498.333 96.6667L498.667 97.3333L498.333 96.6667M609.333 96.6667L609.667 97.3333L609.333 96.6667M630.333 96.6667L630.667 97.3333L630.333 96.6667M636 96L637 97L636 96z"/>
<path style="fill:#d3edaf; stroke:none;" d="M59 97L60 98L59 97z"/>
<path style="fill:#b3d286; stroke:none;" d="M73 97L74 98L73 97M112 97L113 98L112 97z"/>
<path style="fill:#d3edaf; stroke:none;" d="M146 97L147 98L146 97M268 97L269 98L268 97z"/>
<path style="fill:#b3d286; stroke:none;" d="M283 97L284 98L283 97z"/>
<path style="fill:#d3edaf; stroke:none;" d="M438 97L438 100L439 100L438 97z"/>
<path style="fill:#b3d286; stroke:none;" d="M454 97L455 98L454 97M536 97L537 98L536 97M556.333 97.6667L556.667 98.3333L556.333 97.6667M571 97L572 98L571 97z"/>
<path style="fill:#9bbd6b; stroke:none;" d="M594 97L587 107L587 108C591.743 106.348 595.553 102.268 594 97z"/>
<path style="fill:#b3d286; stroke:none;" d="M637 97L638 98L637 97z"/>
<path style="fill:#d3edaf; stroke:none;" d="M655 97L656 98L655 97M58 98L59 99L58 98M71 98L72 99L71 98z"/>
<path style="fill:#b3d286; stroke:none;" d="M104 98L105 99L104 98z"/>
<path style="fill:#9bbd6b; stroke:none;" d="M112 98L106 113L107 113L112 98z"/>
<path style="fill:#d3edaf; stroke:none;" d="M285 98L285 99L288 100L285 98M477 98L478 99L477 98z"/>
<path style="fill:#b3d286; stroke:none;" d="M493.333 98.6667L493.667 99.3333L493.333 98.6667z"/>
<path style="fill:#d3edaf; stroke:none;" d="M498.333 98.6667L498.667 99.3333L498.333 98.6667M514.333 98.6667L514.667 99.3333L514.333 98.6667z"/>
<path style="fill:#9bbd6b; stroke:none;" d="M536 98C532.187 109.208 521.667 110.236 515 101L514 101C517.387 112.958 539.39 110.404 536 98z"/>
<path style="fill:#b3d286; stroke:none;" d="M551 98L552 99L551 98z"/>
<path style="fill:#9bbd6b; stroke:none;" d="M571 98C572.178 106.811 578.001 108.994 586 109L586 108C577.843 107.808 575.271 104.305 571 98z"/>
<path style="fill:#d3edaf; stroke:none;" d="M609.333 98.6667L609.667 99.3333L609.333 98.6667M630 98L630 120L631 120L630 98M637 98L638 99L637 98z"/>
<path style="fill:#b3d286; stroke:none;" d="M56 99L57 100L56 99z"/>
<path style="fill:#d3edaf; stroke:none;" d="M57 99L58 100L57 99M70 99L71 100L70 99z"/>
<path style="fill:#9bbd6b; stroke:none;" d="M103 99C96.2736 113.195 85.3901 139.454 67 140L67 141C81.9196 140.957 91.6077 125.156 97.8912 113C99.9515 109.014 103.752 103.512 103 99z"/>
<path style="fill:#d3edaf; stroke:none;" d="M104 99L105 100L104 99M111 99L112 100L111 99M145 99L146 100L145 99M252 99L252 106L253 106L252 99z"/>
<path style="fill:#b3d286; stroke:none;" d="M267 99L268 100L267 99z"/>
<path style="fill:#d3edaf; stroke:none;" d="M278 99L279 100L278 99z"/>
<path style="fill:#b3d286; stroke:none;" d="M279 99L280 100L279 99z"/>
<path style="fill:#d3edaf; stroke:none;" d="M283 99L284 100L283 99z"/>
<path style="fill:#fefffc; stroke:none;" d="M282 105L287 99L282 105z"/>
<path style="fill:#d3edaf; stroke:none;" d="M455.333 99.6667L455.667 100.333L455.333 99.6667z"/>
<path style="fill:#b3d286; stroke:none;" d="M477 99L478 100L477 99z"/>
<path style="fill:#d3edaf; stroke:none;" d="M535 99L536 100L535 99z"/>
<path style="fill:#9bbd6b; stroke:none;" d="M550 99L549 105L550 105L550 99z"/>
<path style="fill:#d3edaf; stroke:none;" d="M551.333 99.6667L551.667 100.333L551.333 99.6667M556.333 99.6667L556.667 100.333L556.333 99.6667M572 99L573 100L572 99z"/>
<path style="fill:#b3d286; stroke:none;" d="M593 99L594 100L593 99M638 99L639 100L638 99z"/>
<path style="fill:#d3edaf; stroke:none;" d="M656 99L657 100L656 99z"/>
<path style="fill:#9bbd6b; stroke:none;" d="M54 100C46.5688 106.11 40.2032 112.795 33.8449 120C32.0476 122.037 29.0991 126.703 26.0039 126.654C20.554 126.569 16.1404 114.993 14 111L13 111L26 131L27 131L45.0147 110.015L54 100z"/>
<path style="fill:#b3d286; stroke:none;" d="M55 100L56 101L55 100M69 100L70 101L69 100M144 100L145 101L144 100z"/>
<path style="fill:#9bbd6b; stroke:none;" d="M266 100L270 108L266 100z"/>
<path style="fill:#d3edaf; stroke:none;" d="M267 100L267 104L268 104L267 100M277 100L278 101L277 100z"/>
<path style="fill:#b3d286; stroke:none;" d="M280 100L281 101L280 100M287 100L288 101L287 100z"/>
<path style="fill:#d3edaf; stroke:none;" d="M493.333 100.667L493.667 101.333L493.333 100.667z"/>
<path style="fill:#b3d286; stroke:none;" d="M514 100L515 101L514 100M535 100L536 101L535 100M572 100L573 101L572 100z"/>
<path style="fill:#d3edaf; stroke:none;" d="M54 101L55 102L54 101M67 101L68 102L67 101M103 101L104 102L103 101M110 101L111 102L110 101z"/>
<path style="fill:#9bbd6b; stroke:none;" d="M143 101C130.724 115.197 113.539 137.004 92 136C97.8138 129.669 103.586 122.364 106 114L105 114L88 139C104.937 135.714 120.76 128.384 132.985 115.996C136.732 112.199 142.812 106.598 143 101z"/>
<path style="fill:#d3edaf; stroke:none;" d="M144 101L145 102L144 101M279.667 101.333L280.333 101.667L279.667 101.333z"/>
<path style="fill:#b3d286; stroke:none;" d="M282 101L283 102L282 101z"/>
<path style="fill:#d3edaf; stroke:none;" d="M286.333 101.667L286.667 102.333L286.333 101.667z"/>
<path style="fill:#9bbd6b; stroke:none;" d="M287 101L288 102L287 101z"/>
<path style="fill:#d3edaf; stroke:none;" d="M302 101L302 104L303 104L302 101M476 101L477 102L476 101z"/>
<path style="fill:#b3d286; stroke:none;" d="M499 101L500 102L499 101z"/>
<path style="fill:#d3edaf; stroke:none;" d="M515 101L516 102L515 101M534 101L535 102L534 101M592 101L593 102L592 101z"/>
<path style="fill:#b3d286; stroke:none;" d="M639 101L640 102L639 101M657 101L658 102L657 101M10 102L11 103L10 102z"/>
<path style="fill:#d3edaf; stroke:none;" d="M53 102L54 103L53 102z"/>
<path style="fill:#b3d286; stroke:none;" d="M66 102L67 103L66 102M110 102L111 103L110 102M143 102L144 103L143 102z"/>
<path style="fill:#d3edaf; stroke:none;" d="M274 102L275 103L274 102z"/>
<path style="fill:#b3d286; stroke:none;" d="M277 102L278 103L277 102z"/>
<path style="fill:#fefffc; stroke:none;" d="M274 108C277.941 107.358 279.193 105.873 280 102L274 108z"/>
<path style="fill:#b3d286; stroke:none;" d="M280.333 102.667L280.667 103.333L280.333 102.667z"/>
<path style="fill:#d3edaf; stroke:none;" d="M282 102L283 103L282 102z"/>
<path style="fill:#b3d286; stroke:none;" d="M439 102L440 103L439 102z"/>
<path style="fill:#d3edaf; stroke:none;" d="M456 102L457 103L456 102M499.333 102.667L499.667 103.333L499.333 102.667z"/>
<path style="fill:#b3d286; stroke:none;" d="M515 102L516 103L515 102M534 102L535 103L534 102M550 102L551 103L550 102M557 102L558 103L557 102z"/>
<path style="fill:#d3edaf; stroke:none;" d="M573 102L574 103L573 102M591 102L592 103L591 102M608.333 102.667L608.667 103.333L608.333 102.667z"/>
<path style="fill:#9bbd6b; stroke:none;" d="M629 102L629 118L624 118L624 119L630 119L629 102z"/>
<path style="fill:#d3edaf; stroke:none;" d="M658 102L659 103L658 102M10.3333 103.667L10.6667 104.333L10.3333 103.667z"/>
<path style="fill:#b3d286; stroke:none;" d="M65 103L66 104L65 103M102 103L103 104L102 103z"/>
<path style="fill:#d3edaf; stroke:none;" d="M276 103L277 104L276 103z"/>
<path style="fill:#9bbd6b; stroke:none;" d="M286 103L285 106L286 103z"/>
<path style="fill:#d3edaf; stroke:none;" d="M439 103L440 104L439 103M457 103L458 104L457 103z"/>
<path style="fill:#b3d286; stroke:none;" d="M475 103L476 104L475 103M492 103L493 104L492 103z"/>
<path style="fill:#d3edaf; stroke:none;" d="M516 103L517 104L516 103M533 103L534 104L533 103M550 103L551 104L550 103M557 103L558 104L557 103z"/>
<path style="fill:#9bbd6b; stroke:none;" d="M558 103C560.027 111.436 565.596 116.877 574 119L574 118L558 103z"/>
<path style="fill:#b3d286; stroke:none;" d="M591 103L592 104L591 103z"/>
<path style="fill:#d3edaf; stroke:none;" d="M640 103L641 104L640 103M51 104L52 105L51 104M63 104L64 105L63 104M109 104L110 105L109 104M142 104L143 105L142 104z"/>
<path style="fill:#b3d286; stroke:none;" d="M273 104L274 105L273 104z"/>
<path style="fill:#d3edaf; stroke:none;" d="M275 104L276 105L275 104z"/>
<path style="fill:#b3d286; stroke:none;" d="M281 104L282 105L281 104z"/>
<path style="fill:#d3edaf; stroke:none;" d="M474 104L475 105L474 104M492 104L493 105L492 104z"/>
<path style="fill:#b3d286; stroke:none;" d="M574 104L575 105L574 104z"/>
<path style="fill:#d3edaf; stroke:none;" d="M590 104L591 105L590 104z"/>
<path style="fill:#b3d286; stroke:none;" d="M607 104L608 105L607 104z"/>
<path style="fill:#d3edaf; stroke:none;" d="M659 104L660 105L659 104z"/>
<path style="fill:#b3d286; stroke:none;" d="M49 105L50 106L49 105z"/>
<path style="fill:#d3edaf; stroke:none;" d="M62 105L63 106L62 105z"/>
<path style="fill:#b3d286; stroke:none;" d="M101 105L102 106L101 105M141 105L142 106L141 105z"/>
<path style="fill:#d3edaf; stroke:none;" d="M268 105L269 106L268 105z"/>
<path style="fill:#b3d286; stroke:none;" d="M272 105L273 106L272 105z"/>
<path style="fill:#d3edaf; stroke:none;" d="M274 105L275 106L274 105z"/>
<path style="fill:#b3d286; stroke:none;" d="M279 105L280 106L279 105z"/>
<path style="fill:#d3edaf; stroke:none;" d="M281 107L284 105L281 107z"/>
<path style="fill:#b3d286; stroke:none;" d="M284 105L285 106L284 105M301 105L302 106L301 105z"/>
<path style="fill:#d3edaf; stroke:none;" d="M459 105L460 106L459 105M461 105L462 106L461 105z"/>
<path style="fill:#b3d286; stroke:none;" d="M473 105L474 106L473 105M500 105L501 106L500 105z"/>
<path style="fill:#d3edaf; stroke:none;" d="M531 105L532 106L531 105z"/>
<path style="fill:#b3d286; stroke:none;" d="M549 105L550 106L549 105M558 105L559 106L558 105M575 105L576 106L575 105z"/>
<path style="fill:#d3edaf; stroke:none;" d="M589 105L590 106L589 105z"/>
<path style="fill:#9bbd6b; stroke:none;" d="M606 105L604 110L605 110L606 105z"/>
<path style="fill:#d3edaf; stroke:none;" d="M607 105L608 106L607 105M641 105L642 106L641 105z"/>
<path style="fill:#b3d286; stroke:none;" d="M48 106L49 107L48 106M61 106L62 107L61 106z"/>
<path style="fill:#d3edaf; stroke:none;" d="M101 106L102 107L101 106M108 106L109 107L108 106M271 106L272 107L271 106z"/>
<path style="fill:#b3d286; stroke:none;" d="M273 106L274 107L273 106z"/>
<path style="fill:#9bbd6b; stroke:none;" d="M283 106L284 107L283 106z"/>
<path style="fill:#d3edaf; stroke:none;" d="M301 106L302 107L301 106z"/>
<path style="fill:#b3d286; stroke:none;" d="M440 106L441 107L440 106M460 106L461 107L460 106z"/>
<path style="fill:#d3edaf; stroke:none;" d="M470.667 106.333L471.333 106.667L470.667 106.333M491 106L492 107L491 106M500 106L501 107L500 106M519 106L520 107L519 106M530 106L531 107L530 106z"/>
<path style="fill:#b3d286; stroke:none;" d="M533 106L534 107L533 106z"/>
<path style="fill:#9bbd6b; stroke:none;" d="M548 106C541.37 114.57 535.066 118.969 524 119L524 120C532.516 119.994 547.977 117.307 548 106z"/>
<path style="fill:#d3edaf; stroke:none;" d="M549 106L550 107L549 106M558 106L559 107L558 106M577 106L578 107L577 106z"/>
<path style="fill:#b3d286; stroke:none;" d="M588 106L589 107L588 106M660 106L661 107L660 106z"/>
<path style="fill:#d3edaf; stroke:none;" d="M11 107L12 108L11 107z"/>
<path style="fill:#b3d286; stroke:none;" d="M47 107L48 108L47 107M60 107L61 108L60 107M100 107L101 108L100 107M108 107L109 108L108 107z"/>
<path style="fill:#d3edaf; stroke:none;" d="M140 107L141 108L140 107M270 107L271 108L270 107M273 107L277 109L277 108L273 107z"/>
<path style="fill:#b3d286; stroke:none;" d="M278 107L279 108L278 107M280.667 107.333L281.333 107.667L280.667 107.333z"/>
<path style="fill:#9bbd6b; stroke:none;" d="M282 107L283 108L282 107z"/>
<path style="fill:#d3edaf; stroke:none;" d="M463 107L463 108L469 108L463 107z"/>
<path style="fill:#b3d286; stroke:none;" d="M469 107L470 108L469 107M501 107L502 108L501 107M521 107L522 108L521 107z"/>
<path style="fill:#d3edaf; stroke:none;" d="M522 107L523 108L522 107M528 107L529 108L528 107z"/>
<path style="fill:#b3d286; stroke:none;" d="M548 107L549 108L548 107z"/>
<path style="fill:#d3edaf; stroke:none;" d="M579 107L580 108L579 107M585.667 107.333L586.333 107.667L585.667 107.333M606 107L607 108L606 107M642 107L643 108L642 107M661 107L662 108L661 107z"/>
<path style="fill:#b3d286; stroke:none;" d="M46 108L47 109L46 108z"/>
<path style="fill:#d3edaf; stroke:none;" d="M100 108L101 109L100 108z"/>
<path style="fill:#b3d286; stroke:none;" d="M139 108L140 109L139 108M253 108L254 109L253 108M272 108L273 109L272 108M277 108L278 109L277 108z"/>
<path style="fill:#9bbd6b; stroke:none;" d="M281 108L282 109L281 108z"/>
<path style="fill:#d3edaf; stroke:none;" d="M300 108L301 109L300 108z"/>
<path style="fill:#b3d286; stroke:none;" d="M441 108L442 109L441 108z"/>
<path style="fill:#d3edaf; stroke:none;" d="M490 108L491 109L490 108M501 108L502 109L501 108M548 108L549 109L548 108M559 108L560 109L559 108z"/>
<path style="fill:#b3d286; stroke:none;" d="M643 108L644 109L643 108M661 108L662 109L661 108M45 109L46 110L45 109z"/>
<path style="fill:#d3edaf; stroke:none;" d="M57 109L58 110L57 109z"/>
<path style="fill:#b3d286; stroke:none;" d="M99 109L100 110L99 109M107 109L108 110L107 109M138 109L139 110L138 109z"/>
<path style="fill:#d3edaf; stroke:none;" d="M253 109L254 110L253 109z"/>
<path style="fill:#9bbd6b; stroke:none;" d="M273 109L273 110L277 110L273 109z"/>
<path style="fill:#b3d286; stroke:none;" d="M502 109L503 110L502 109M547 109L548 110L547 109z"/>
<path style="fill:#d3edaf; stroke:none;" d="M605 109L606 110L605 109M643 109L644 110L643 109M662 109L663 110L662 109z"/>
<path style="fill:#b3d286; stroke:none;" d="M12 110L13 111L12 110M44 110L45 111L44 110z"/>
<path style="fill:#d3edaf; stroke:none;" d="M56 110L57 111L56 110M99 110L100 111L99 110M299 110L300 111L299 110M442 110L443 111L442 110M489 110L490 111L489 110M560 110L561 111L560 110z"/>
<path style="fill:#b3d286; stroke:none;" d="M604 110L605 111L604 110M644 110L645 111L644 110z"/>
<path style="fill:#d3edaf; stroke:none;" d="M12 111L13 112L12 111z"/>
<path style="fill:#b3d286; stroke:none;" d="M43 111L44 112L43 111z"/>
<path style="fill:#d3edaf; stroke:none;" d="M54.6667 111.333L55.3333 111.667L54.6667 111.333z"/>
<path style="fill:#b3d286; stroke:none;" d="M106 111L107 112L106 111z"/>
<path style="fill:#d3edaf; stroke:none;" d="M137 111L138 112L137 111z"/>
<path style="fill:#b3d286; stroke:none;" d="M254 111L255 112L254 111M298 111L297 113L298 111M443 111L444 112L443 111M488 111L489 112L488 111z"/>
<path style="fill:#d3edaf; stroke:none;" d="M503 111L504 112L503 111M546 111L547 112L546 111M561 111L562 112L561 111z"/>
<path style="fill:#9bbd6b; stroke:none;" d="M603 111L604 112L603 111z"/>
<path style="fill:#d3edaf; stroke:none;" d="M644 111L645 112L644 111z"/>
<path style="fill:#9bbd6b; stroke:none;" d="M645 111L651 119L645 111z"/>
<path style="fill:#d3edaf; stroke:none;" d="M663 111L664 112L663 111z"/>
<path style="fill:#b3d286; stroke:none;" d="M13 112L14 113L13 112M42 112L43 113L42 112M54 112L55 113L54 112z"/>
<path style="fill:#d3edaf; stroke:none;" d="M98 112L99 113L98 112M136 112L137 113L136 112M298 112L299 113L298 112z"/>
<path style="fill:#b3d286; stroke:none;" d="M444 112L445 113L444 112z"/>
<path style="fill:#d3edaf; stroke:none;" d="M504 112L505 113L504 112M545 112L546 113L545 112z"/>
<path style="fill:#b3d286; stroke:none;" d="M562 112L563 113L562 112z"/>
<path style="fill:#9bbd6b; stroke:none;" d="M600 112L592 118L592 119L603 112L600 112z"/>
<path style="fill:#b3d286; stroke:none;" d="M645 112L646 113L645 112z"/>
<path style="fill:#d3edaf; stroke:none;" d="M13 113L14 114L13 113z"/>
<path style="fill:#b3d286; stroke:none;" d="M41 113L42 114L41 113M53 113L54 114L53 113M97 113L98 114L97 113M105 113L106 114L105 113z"/>
<path style="fill:#d3edaf; stroke:none;" d="M135 113L136 114L135 113M255 113L256 114L255 113z"/>
<path style="fill:#b3d286; stroke:none;" d="M505 113L506 114L505 113M544 113L545 114L544 113z"/>
<path style="fill:#d3edaf; stroke:none;" d="M602 113L603 114L602 113z"/>
<path style="fill:#b3d286; stroke:none;" d="M664 113L665 114L664 113M40 114L41 115L40 114M52 114L53 115L52 114z"/>
<path style="fill:#d3edaf; stroke:none;" d="M97 114L98 115L97 114M134 114L135 115L134 114z"/>
<path style="fill:#b3d286; stroke:none;" d="M193 114L194 115L193 114M256 114L257 115L256 114M295 114L296 115L295 114z"/>
<path style="fill:#d3edaf; stroke:none;" d="M296 114L297 115L296 114z"/>
<path style="fill:#b3d286; stroke:none;" d="M446 114L447 115L446 114z"/>
<path style="fill:#d3edaf; stroke:none;" d="M486 114L487 115L486 114M506 114L507 115L506 114M543 114L544 115L543 114z"/>
<path style="fill:#b3d286; stroke:none;" d="M564 114L565 115L564 114z"/>
<path style="fill:#d3edaf; stroke:none;" d="M601 114L602 115L601 114M646 114L647 115L646 114M665 114L666 115L665 114M14 115L15 116L14 115M50 115L51 116L50 115z"/>
<path style="fill:#b3d286; stroke:none;" d="M51 115L52 116L51 115M96 115L97 116L96 115M104 115L105 116L104 115M133 115L134 116L133 115z"/>
<path style="fill:#d3edaf; stroke:none;" d="M193 115L194 116L193 115z"/>
<path style="fill:#b3d286; stroke:none;" d="M257 115L258 116L257 115M294 115L295 116L294 115M417 115L418 116L417 115z"/>
<path style="fill:#d3edaf; stroke:none;" d="M447 115L448 116L447 115z"/>
<path style="fill:#b3d286; stroke:none;" d="M448 115L449 116L448 115z"/>
<path style="fill:#d3edaf; stroke:none;" d="M485 115L486 116L485 115M507 115L508 116L507 115M542 115L543 116L542 115M565 115L566 116L565 115M600 115L601 116L600 115z"/>
<path style="fill:#b3d286; stroke:none;" d="M50 116L51 117L50 116z"/>
<path style="fill:#d3edaf; stroke:none;" d="M103 116L104 117L103 116z"/>
<path style="fill:#b3d286; stroke:none;" d="M132 116L133 117L132 116M193 116L194 117L193 116z"/>
<path style="fill:#d3edaf; stroke:none;" d="M258 116L259 117L258 116M293 116L294 117L293 116z"/>
<path style="fill:#b3d286; stroke:none;" d="M449 116L450 117L449 116M483 116L484 117L483 116M509 116L510 117L509 116M540 116L541 117L540 116z"/>
<path style="fill:#d3edaf; stroke:none;" d="M541 116L542 117L541 116z"/>
<path style="fill:#b3d286; stroke:none;" d="M567 116L568 117L567 116M598 116L599 117L598 116z"/>
<path style="fill:#d3edaf; stroke:none;" d="M647 116L648 117L647 116M666 116L667 117L666 116M15 117L16 118L15 117z"/>
<path style="fill:#b3d286; stroke:none;" d="M49 117L50 118L49 117z"/>
<path style="fill:#d3edaf; stroke:none;" d="M95 117L96 118L95 117z"/>
<path style="fill:#b3d286; stroke:none;" d="M103 117L104 118L103 117M131 117L132 118L131 117z"/>
<path style="fill:#d3edaf; stroke:none;" d="M193 117L193 120L194 120L193 117M259 117L260 118L259 117M291.667 117.333L292.333 117.667L291.667 117.333z"/>
<path style="fill:#9bbd6b; stroke:none;" d="M345 117L345 119L347 119L345 117z"/>
<path style="fill:#d3edaf; stroke:none;" d="M418 117L419 118L418 117M451 117L452 118L451 117z"/>
<path style="fill:#b3d286; stroke:none;" d="M452 117L453 118L452 117z"/>
<path style="fill:#d3edaf; stroke:none;" d="M482 117L483 118L482 117M510 117L511 118L510 117z"/>
<path style="fill:#b3d286; stroke:none;" d="M511 117L512 118L511 117z"/>
<path style="fill:#d3edaf; stroke:none;" d="M539 117L540 118L539 117M568 117L569 118L568 117z"/>
<path style="fill:#b3d286; stroke:none;" d="M596 117L597 118L596 117z"/>
<path style="fill:#d3edaf; stroke:none;" d="M597 117L598 118L597 117M667 117L668 118L667 117M37 118L38 119L37 118z"/>
<path style="fill:#b3d286; stroke:none;" d="M48 118L49 119L48 118z"/>
<path style="fill:#d3edaf; stroke:none;" d="M102 118L103 119L102 118M130 118L131 119L130 118M261 118L262 119L261 118z"/>
<path style="fill:#b3d286; stroke:none;" d="M262 118L263 119L262 118z"/>
<path style="fill:#d3edaf; stroke:none;" d="M289 118L290 119L289 118z"/>
<path style="fill:#9bbd6b; stroke:none;" d="M313 118L313 119L318 119L313 118z"/>
<path style="fill:#d3edaf; stroke:none;" d="M419 118L420 119L419 118M453 118L454 119L453 118z"/>
<path style="fill:#b3d286; stroke:none;" d="M454 118L455 119L454 118M479 118L480 119L479 118z"/>
<path style="fill:#d3edaf; stroke:none;" d="M480 118L481 119L480 118M512 118L513 119L512 118z"/>
<path style="fill:#b3d286; stroke:none;" d="M513 118L514 119L513 118M536 118L537 119L536 118z"/>
<path style="fill:#d3edaf; stroke:none;" d="M537 118L538 119L537 118M570 118L571 119L570 118z"/>
<path style="fill:#b3d286; stroke:none;" d="M571 118L572 119L571 118M594 118L595 119L594 118z"/>
<path style="fill:#d3edaf; stroke:none;" d="M595 118L596 119L595 118M648 118L649 119L648 118z"/>
<path style="fill:#9bbd6b; stroke:none;" d="M656 118L656 119L659 119L656 118z"/>
<path style="fill:#b3d286; stroke:none;" d="M667 118L649 119L649 120L667 118z"/>
<path style="fill:#d3edaf; stroke:none;" d="M16 119L17 120L16 119M36 119L37 120L36 119z"/>
<path style="fill:#b3d286; stroke:none;" d="M47 119L48 120L47 119z"/>
<path style="fill:#d3edaf; stroke:none;" d="M129 119L130 120L129 119z"/>
<path style="fill:#b3d286; stroke:none;" d="M194 119L194 120L208 120L194 119z"/>
<path style="fill:#d3edaf; stroke:none;" d="M263 119L264 120L263 119z"/>
<path style="fill:#b3d286; stroke:none;" d="M264 119L265 120L264 119z"/>
<path style="fill:#9bbd6b; stroke:none;" d="M275 119L275 120L285 120L275 119z"/>
<path style="fill:#b3d286; stroke:none;" d="M285 119L286 120L285 119z"/>
<path style="fill:#d3edaf; stroke:none;" d="M286.667 119.333L287.333 119.667L286.667 119.333z"/>
<path style="fill:#b3d286; stroke:none;" d="M308 119L308 120L323 120L308 119z"/>
<path style="fill:#d3edaf; stroke:none;" d="M344 119L345 120L344 119z"/>
<path style="fill:#b3d286; stroke:none;" d="M381 119L381 120L396 120L381 119z"/>
<path style="fill:#d3edaf; stroke:none;" d="M421 119L422 120L421 119z"/>
<path style="fill:#b3d286; stroke:none;" d="M422 119L422 120L432 120L422 119z"/>
<path style="fill:#d3edaf; stroke:none;" d="M456 119L457 120L456 119z"/>
<path style="fill:#b3d286; stroke:none;" d="M457 119L458 120L457 119M476 119L477 120L476 119z"/>
<path style="fill:#d3edaf; stroke:none;" d="M477 119L478 120L477 119M515 119L516 120L515 119z"/>
<path style="fill:#b3d286; stroke:none;" d="M516 119L517 120L516 119M533 119L534 120L533 119z"/>
<path style="fill:#d3edaf; stroke:none;" d="M534.667 119.333L535.333 119.667L534.667 119.333M573 119L574 120L573 119z"/>
<path style="fill:#b3d286; stroke:none;" d="M574 119L575 120L574 119z"/>
<path style="fill:#9bbd6b; stroke:none;" d="M575 119L575 120L591 120L575 119z"/>
<path style="fill:#b3d286; stroke:none;" d="M591 119L592 120L591 119z"/>
<path style="fill:#d3edaf; stroke:none;" d="M592 119L593 120L592 119z"/>
<path style="fill:#b3d286; stroke:none;" d="M615 119L615 120L630 120L615 119M17 120L18 121L17 120z"/>
<path style="fill:#d3edaf; stroke:none;" d="M35 120L36 121L35 120z"/>
<path style="fill:#b3d286; stroke:none;" d="M46 120L47 121L46 120M93 120L94 121L93 120z"/>
<path style="fill:#d3edaf; stroke:none;" d="M101 120L102 121L101 120M128 120L129 121L128 120M266.667 120.333L267.333 120.667L266.667 120.333z"/>
<path style="fill:#b3d286; stroke:none;" d="M268 120L268 121L272 121L268 120M274 120L274 121L280 121L274 120z"/>
<path style="fill:#d3edaf; stroke:none;" d="M280 120L280 121L283 121L280 120M460.667 120.333L461.333 120.667L460.667 120.333z"/>
<path style="fill:#b3d286; stroke:none;" d="M462 120L462 121L466 121L462 120M469 120L469 121L472 121L469 120z"/>
<path style="fill:#d3edaf; stroke:none;" d="M472.667 120.333L473.333 120.667L472.667 120.333M519 120L520 121L519 120z"/>
<path style="fill:#b3d286; stroke:none;" d="M520 120L520 121L530 121L520 120z"/>
<path style="fill:#d3edaf; stroke:none;" d="M530.667 120.333L531.333 120.667L530.667 120.333M576.667 120.333L577.333 120.667L576.667 120.333z"/>
<path style="fill:#b3d286; stroke:none;" d="M578 120L578 121L587 121L578 120z"/>
<path style="fill:#d3edaf; stroke:none;" d="M587 120L587 121L590 121L587 120M17 121L18 122L17 121M34 121L35 122L34 121z"/>
<path style="fill:#b3d286; stroke:none;" d="M45 121L46 122L45 121z"/>
<path style="fill:#d3edaf; stroke:none;" d="M18 122L19 123L18 122z"/>
<path style="fill:#b3d286; stroke:none;" d="M33 122L32 124L33 122z"/>
<path style="fill:#d3edaf; stroke:none;" d="M44 122L45 123L44 122M92 122L93 123L92 122z"/>
<path style="fill:#b3d286; stroke:none;" d="M100 122L101 123L100 122M125 122L126 123L125 122M19 123L20 124L19 123z"/>
<path style="fill:#d3edaf; stroke:none;" d="M33 123L34 124L33 123M43 123L44 124L43 123M91 123L92 124L91 123M99 123L100 124L99 123z"/>
<path style="fill:#b3d286; stroke:none;" d="M124 123L125 124L124 123z"/>
<path style="fill:#d3edaf; stroke:none;" d="M32 124L33 125L32 124z"/>
<path style="fill:#b3d286; stroke:none;" d="M90 124L91 125L90 124M99 124L100 125L99 124z"/>
<path style="fill:#d3edaf; stroke:none;" d="M123 124L124 125L123 124M31 125L32 126L31 125M41 125L42 126L41 125M90 125L91 126L90 125M98 125L99 126L98 125z"/>
<path style="fill:#b3d286; stroke:none;" d="M121 125L122 126L121 125z"/>
<path style="fill:#d3edaf; stroke:none;" d="M21 126L22 127L21 126M30 126L31 127L30 126M89 126L90 127L89 126M97 126L98 127L97 126M120 126L121 127L120 126M22 127L23 128L22 127z"/>
<path style="fill:#b3d286; stroke:none;" d="M40 127L41 128L40 127M88 127L89 128L88 127M118 127L119 128L118 127z"/>
<path style="fill:#d3edaf; stroke:none;" d="M23 128L24 129L23 128M39 128L40 129L39 128z"/>
<path style="fill:#b3d286; stroke:none;" d="M87 128L88 129L87 128M96 128L97 129L96 128M116 128L117 129L116 128z"/>
<path style="fill:#d3edaf; stroke:none;" d="M117 128L118 129L117 128M24 129L25 130L24 129M28 129L29 130L28 129M38 129L39 130L38 129z"/>
<path style="fill:#b3d286; stroke:none;" d="M86 129L87 130L86 129z"/>
<path style="fill:#d3edaf; stroke:none;" d="M95 129L96 130L95 129M115 129L116 130L115 129z"/>
<path style="fill:#b3d286; stroke:none;" d="M27 130L28 131L27 130z"/>
<path style="fill:#d3edaf; stroke:none;" d="M37 130L38 131L37 130M94 130L95 131L94 130M113 130L114 131L113 130z"/>
<path style="fill:#b3d286; stroke:none;" d="M37 131L38 132L37 131z"/>
<path style="fill:#d3edaf; stroke:none;" d="M85 131L86 132L85 131M111 131L112 132L111 131z"/>
<path style="fill:#b3d286; stroke:none;" d="M36 132L37 133L36 132z"/>
<path style="fill:#d3edaf; stroke:none;" d="M84 132L85 133L84 132z"/>
<path style="fill:#b3d286; stroke:none;" d="M93 132L94 133L93 132z"/>
<path style="fill:#d3edaf; stroke:none;" d="M109 132L110 133L109 132M35 133L36 134L35 133M83 133L84 134L83 133z"/>
<path style="fill:#b3d286; stroke:none;" d="M92 133L93 134L92 133M106 133L107 134L106 133z"/>
<path style="fill:#d3edaf; stroke:none;" d="M107 133L108 134L107 133M82 134L83 135L82 134M90 134L90 136L92 134L90 134z"/>
<path style="fill:#b3d286; stroke:none;" d="M104 134L105 135L104 134z"/>
<path style="fill:#d3edaf; stroke:none;" d="M105 134L106 135L105 134M81 135L82 136L81 135z"/>
<path style="fill:#b3d286; stroke:none;" d="M101 135L102 136L101 135z"/>
<path style="fill:#d3edaf; stroke:none;" d="M102 135L103 136L102 135M34 136L35 137L34 136z"/>
<path style="fill:#b3d286; stroke:none;" d="M35 136L36 137L35 136z"/>
<path style="fill:#d3edaf; stroke:none;" d="M80 136L81 137L80 136z"/>
<path style="fill:#b3d286; stroke:none;" d="M98 136L99 137L98 136z"/>
<path style="fill:#d3edaf; stroke:none;" d="M99 136L100 137L99 136M36 137L37 138L36 137z"/>
<path style="fill:#b3d286; stroke:none;" d="M37 137L38 138L37 137z"/>
<path style="fill:#d3edaf; stroke:none;" d="M79 137L80 138L79 137M88 137L89 138L88 137M95.6667 137.333L96.3333 137.667L95.6667 137.333M38.6667 138.333L39.3333 138.667L38.6667 138.333z"/>
<path style="fill:#b3d286; stroke:none;" d="M40 138L41 139L40 138M90.6667 138.333L91.3333 138.667L90.6667 138.333z"/>
<path style="fill:#d3edaf; stroke:none;" d="M92 138L93 139L92 138M41.6667 139.333L42.3333 139.667L41.6667 139.333z"/>
<path style="fill:#b3d286; stroke:none;" d="M43 139L44 140L43 139z"/>
<path style="fill:#d3edaf; stroke:none;" d="M87.6667 139.333L88.3333 139.667L87.6667 139.333M46 140L47 141L46 140z"/>
<path style="fill:#b3d286; stroke:none;" d="M47.6667 140.333L48.3333 140.667L47.6667 140.333z"/>
<path style="fill:#9bbd6b; stroke:none;" d="M49 140L49 141L64 141L49 140z"/>
<path style="fill:#b3d286; stroke:none;" d="M75 140L76 141L75 140z"/>
<path style="fill:#d3edaf; stroke:none;" d="M52 141L52 142L56 142L52 141z"/>
<path style="fill:#b3d286; stroke:none;" d="M56 141L56 142L69 142L56 141z"/>
<path style="fill:#d3edaf; stroke:none;" d="M69 141L69 142L74 142L69 141z"/>
</svg>
