1.  std::cout << f[6] << std::endl;
2.  double b[5] = {0};
    std::cin  >> b[4];
3.  int g[5];
    for (int i = 0; i < 5; ++i) {
        g[i] = 8;
    }

4.  double sum = 0.0;
    for (int i = 0; i < 100; ++i) {
        sum += g[i];
    }

    std::cout << sum << std::endl;

5.  for (int i = 0; i < 11; ++i) {
        b[i] = a[i];
    }

6.  double min = w[0], max = w[0];
    for (int i = 1; i < 100; ++i) {
        if (min > w[i]) {
            min = w[i];
        }

        if (max < w[i]) {
            max = w[i];
        }
    }

    std::cout << "min: " << min << "\n"
              << "max: " << max << std::endl;


