{
   "workflow_name": "energy_slab_ver_1",
   "nodes": [
      {
         "name": "Relax_structure_O_two",
         "id": 0,
         "tasks": [
            {
               "func": [
                  "ueffumax",
                  "build_structure_generic"
               ],
               "inputs": [
                  "parameters_id0"
               ],
               "outputs": [
                  "structure_id0"
               ],
               "kwargs": {}
            },
            {
               "func": [
                  "ueffumax",
                  "structure_relaxation"
               ],
               "inputs": [
                  "parameters_id0",
                  "structure_id0"
               ],
               "outputs": [
                  "relaxed_structure_id0",
                  "energy_id0",
                  "forces_id0",
                  "dipole_id0"
               ],
               "kwargs": {}
            },
            {
               "func": [
                  "BUILTIN",
                  "MERGE"
               ],
               "inputs": [
                  "energy_id0",
                  "zero_point_energy_id0",
                  "total_entropy_term_id0",
                  "energy_minimum_id0"
               ],
               "outputs": [
                  "o_two_id0"
               ],
               "kwargs": {}
            }
         ]
      },
      {
         "name": "Relax_structure_star_O",
         "id": 1,
         "tasks": [
            {
               "func": [
                  "ueffumax",
                  "build_structure"
               ],
               "inputs": [
                  "parameters_id1"
               ],
               "outputs": [
                  "structure_id1"
               ],
               "kwargs": {}
            },
            {
               "func": [
                  "ueffumax",
                  "structure_relaxation"
               ],
               "inputs": [
                  "parameters_id1",
                  "structure_id1"
               ],
               "outputs": [
                  "relaxed_structure_id1",
                  "energy_id1",
                  "forces_id1",
                  "dipole_id1"
               ],
               "kwargs": {}
            }
         ]
      },
      {
         "name": "Normal_mode_analysis_star_O",
         "id": 2,
         "tasks": [
            {
               "func": [
                  "ueffumax",
                  "vibrations"
               ],
               "inputs": [
                  "parameters_id2",
                  "relaxed_structure_id1"
               ],
               "outputs": [
                  "vibrational_energies_id2",
                  "vibrational_entropy_id2",
                  "vibrational_entropy_term_id2",
                  "vibrational_partition_func_id2",
                  "zero_point_energy_id2",
                  "transition_state_id2",
                  "energy_minimum_id2"
               ],
               "kwargs": {}
            }
         ]
      },
      {
         "name": "Merge_properties_star_O",
         "id": 3,
         "tasks": [
            {
               "func": [
                  "BUILTIN",
                  "MERGE"
               ],
               "inputs": [
                  "energy_minimum_id2",
                  "energy_id1",
                  "zero_point_energy_id2",
                  "vibrational_entropy_term_id2",
                  "rotational_entropy_term_id3",
                  "translational_entropy_term_id3"
               ],
               "outputs": [
                  "star_o_id3"
               ],
               "kwargs": {}
            }
         ]
      },
      {
         "name": "Relax_structure_star",
         "id": 4,
         "tasks": [
            {
               "func": [
                  "ueffumax",
                  "build_structure"
               ],
               "inputs": [
                  "parameters_id4"
               ],
               "outputs": [
                  "structure_id4"
               ],
               "kwargs": {}
            },
            {
               "func": [
                  "ueffumax",
                  "structure_relaxation"
               ],
               "inputs": [
                  "parameters_id4",
                  "structure_id4"
               ],
               "outputs": [
                  "relaxed_structure_id4",
                  "energy_id4",
                  "forces_id4",
                  "dipole_id4"
               ],
               "kwargs": {}
            }
         ]
      },
      {
         "name": "Normal_mode_analysis_star",
         "id": 5,
         "tasks": [
            {
               "func": [
                  "ueffumax",
                  "vibrations"
               ],
               "inputs": [
                  "parameters_id5",
                  "relaxed_structure_id4"
               ],
               "outputs": [
                  "vibrational_energies_id5",
                  "vibrational_entropy_id5",
                  "vibrational_entropy_term_id5",
                  "vibrational_partition_func_id5",
                  "zero_point_energy_id5",
                  "transition_state_id5",
                  "energy_minimum_id5"
               ],
               "kwargs": {}
            }
         ]
      },
      {
         "name": "Merge_star",
         "id": 6,
         "tasks": [
            {
               "func": [
                  "BUILTIN",
                  "MERGE"
               ],
               "inputs": [
                  "energy_minimum_id5",
                  "energy_id4",
                  "zero_point_energy_id5",
                  "vibrational_entropy_term_id5",
                  "rotational_entropy_term_id6",
                  "translational_entropy_term_id6"
               ],
               "outputs": [
                  "star_id6"
               ],
               "kwargs": {}
            }
         ]
      },
      {
         "name": "Adsorption_energies",
         "id": 7,
         "tasks": [
            {
               "func": [
                  "BUILTIN",
                  "MERGE"
               ],
               "inputs": [
                  "star_id6",
                  "star_o_id3",
                  "o_two_id0"
               ],
               "outputs": [
                  "properties"
               ],
               "kwargs": {}
            },
            {
               "func": [
                  "ueffumax",
                  "reaction_energies"
               ],
               "inputs": [
                  "properties",
                  "reactions"
               ],
               "outputs": [
                  "reaction_properties"
               ],
               "kwargs": {}
            }
         ]
      }
   ]
}