{
    "message": "Chat(s) found successfully.",
    "data": [
             {
             "messages": [
                          {
                          "chatId": "5911a9559696b5b872f15ab7",
                          "messageBody": "Yo",
                          "type": "text",
                          "creatorId": 3,
                          "createdAt": "2017-05-10T14:23:07.289Z",
                          "updatedAt": "2017-05-10T14:23:07.289Z",
                          "id": "5913224b86e66eaf3b8f423c"
                          },
                          {
                          "chatId": "5911a9559696b5b872f15ab7",
                          "messageBody": "Yasdasdo",
                          "type": "text",
                          "creatorId": 3,
                          "createdAt": "2017-05-10T14:25:09.338Z",
                          "updatedAt": "2017-05-10T14:25:09.338Z",
                          "id": "591322c586e66eaf3b8f423d"
                          },
                          {
                          "chatId": "5911a9559696b5b872f15ab7",
                          "messageBody": "32a1s3d21a321d32as1d",
                          "type": "text",
                          "creatorId": 3,
                          "createdAt": "2017-05-10T14:25:13.916Z",
                          "updatedAt": "2017-05-10T14:25:13.916Z",
                          "id": "591322c986e66eaf3b8f423e"
                          },
                          {
                          "chatId": "5911a9559696b5b872f15ab7",
                          "messageBody": "32a1s3d21a31a3s1d3a1sd31a3sd121d32as1d",
                          "type": "text",
                          "creatorId": 3,
                          "createdAt": "2017-05-10T14:25:17.381Z",
                          "updatedAt": "2017-05-10T14:25:17.381Z",
                          "id": "591322cd86e66eaf3b8f423f"
                          }
                          ],
             "userchats": [
                           {
                           "userId": 3,
                           "addedById": 3,
                           "type": "group",
                           "chatId": "5911a9559696b5b872f15ab7",
                           "unreadCount": 0,
                           "lastSeenMessage": "",
                           "removedById": null,
                           "createdAt": "2017-05-09T11:34:45.204Z",
                           "updatedAt": "2017-05-11T14:01:41.278Z",
                           "id": "5911a9559696b5b872f15ab8"
                           },
                           {
                           "userId": 4,
                           "addedById": 3,
                           "type": "group",
                           "chatId": "5911a9559696b5b872f15ab7",
                           "unreadCount": 4,
                           "lastSeenMessage": "591322cd86e66eaf3b8f423f",
                           "removedById": null,
                           "createdAt": "2017-05-09T11:34:45.205Z",
                           "updatedAt": "2017-05-10T14:25:17.388Z",
                           "id": "5911a9559696b5b872f15ab9"
                           }
                           ],
             "type": "group",
             "name": "HSP_JP",
             "creatorId": 3,
             "createdAt": "2017-05-09T11:34:45.150Z",
             "updatedAt": "2017-05-09T11:34:45.171Z",
             "id": "5911a9559696b5b872f15ab7",
             "unread": 0,
             "canSendMessage": true
             },
             {
             "messages": [
                          {
                          "chatId": "5912c1c086e66eaf3b8f4233",
                          "messageBody": "abc abc",
                          "type": "text",
                          "creatorId": 1,
                          "createdAt": "2017-05-12T06:23:46.871Z",
                          "updatedAt": "2017-05-12T06:23:46.871Z",
                          "id": "591554f289c78f3755c3e070"
                          }
                          ],
             "userchats": [
                           {
                           "userId": 3,
                           "addedById": 1,
                           "type": "group",
                           "chatId": "5912c1c086e66eaf3b8f4233",
                           "unreadCount": 1,
                           "lastSeenMessage": "591554f289c78f3755c3e070",
                           "removedById": null,
                           "createdAt": "2017-05-10T07:31:12.246Z",
                           "updatedAt": "2017-05-12T06:23:46.888Z",
                           "id": "5912c1c086e66eaf3b8f4234"
                           },
                           {
                           "userId": 4,
                           "addedById": 1,
                           "type": "group",
                           "chatId": "5912c1c086e66eaf3b8f4233",
                           "unreadCount": 1,
                           "lastSeenMessage": "591554f289c78f3755c3e070",
                           "removedById": null,
                           "createdAt": "2017-05-10T07:31:12.247Z",
                           "updatedAt": "2017-05-12T06:23:46.888Z",
                           "id": "5912c1c086e66eaf3b8f4235"
                           },
                           {
                           "userId": 1,
                           "addedById": 1,
                           "type": "group",
                           "chatId": "5912c1c086e66eaf3b8f4233",
                           "unreadCount": 0,
                           "lastSeenMessage": "",
                           "removedById": null,
                           "createdAt": "2017-05-10T07:31:12.247Z",
                           "updatedAt": "2017-05-12T06:23:03.047Z",
                           "id": "5912c1c086e66eaf3b8f4236"
                           }
                           ],
             "type": "group",
             "name": "HSP",
             "creatorId": 1,
             "createdAt": "2017-05-10T07:31:12.221Z",
             "updatedAt": "2017-05-10T07:31:12.235Z",
             "id": "5912c1c086e66eaf3b8f4233",
             "unread": 1,
             "canSendMessage": true
             },
             {
             "messages": [],
             "userchats": [
                           {
                           "userId": 3,
                           "addedById": 3,
                           "type": "group",
                           "chatId": "5913204286e66eaf3b8f4238",
                           "unreadCount": 0,
                           "lastSeenMessage": "",
                           "removedById": null,
                           "createdAt": "2017-05-10T14:14:26.967Z",
                           "updatedAt": "2017-05-10T14:14:26.967Z",
                           "id": "5913204286e66eaf3b8f4239"
                           },
                           {
                           "userId": 4,
                           "addedById": 3,
                           "type": "group",
                           "chatId": "5913204286e66eaf3b8f4238",
                           "unreadCount": 0,
                           "lastSeenMessage": "",
                           "removedById": null,
                           "createdAt": "2017-05-10T14:14:26.968Z",
                           "updatedAt": "2017-05-10T14:14:26.968Z",
                           "id": "5913204286e66eaf3b8f423a"
                           }
                           ],
             "type": "group",
             "name": "HSP",
             "creatorId": 3,
             "createdAt": "2017-05-10T14:14:26.940Z",
             "updatedAt": "2017-05-10T14:14:26.956Z",
             "id": "5913204286e66eaf3b8f4238",
             "unread": 0,
             "canSendMessage": true
             }
             ]
}
