<svg width="50" height="50" viewBox="0 0 50 50" fill="none" xmlns="http://www.w3.org/2000/svg">
<circle cx="25.05" cy="25.05" r="23.75" fill="#333232"/>
<path d="M23.947 40.4853V39.3823H22.8441H21.7412V38.2794V37.1765H20.6382H19.5353V36.0735V34.9706H15.1235H10.7118V33.8676V32.7647H12.9176H15.1235V31.6618V30.5588H14.0206H12.9176V29.4559V28.3529H11.8147H10.7118V27.25V26.1471H9.60881H8.50587V27.25V28.3529H7.40293H6.29999V27.25V26.1471H7.40293H8.50587V25.0441V23.9412H7.40293H6.29999V22.8382V21.7353H7.40293H8.50587V22.8382V23.9412H9.60881H10.7118V22.8382V21.7353H11.8147H12.9176V20.6324V19.5294H14.0206H15.1235V18.4265V17.3235H12.9176H10.7118V16.2206V15.1176H15.1235H19.5353V14.0147V12.9118H20.6382H21.7412V11.8088V10.7059H22.8441H23.947V9.60294V8.5H25.05H26.1529V9.60294V10.7059H27.2559H28.3588V11.8088V12.9118H29.4618H30.5647V14.0147V15.1176H36.0794H41.5941V16.2206V17.3235H38.2853H34.9765V18.4265V19.5294H36.0794H37.1823V20.6324V21.7353H38.2853H39.3882V22.8382V23.9412H40.4912H41.5941V22.8382V21.7353H42.697H43.8V22.8382V23.9412H42.697H41.5941V25.0441V26.1471H42.697H43.8V27.25V28.3529H42.697H41.5941V27.25V26.1471H40.4912H39.3882V27.25V28.3529H38.2853H37.1823V29.4559V30.5588H36.0794H34.9765V31.6618V32.7647H38.2853H41.5941V33.8676V34.9706H36.0794H30.5647V36.0735V37.1765H29.4618H28.3588V38.2794V39.3823H27.2559H26.1529V40.4853V41.5882H25.05H23.947V40.4853ZM26.1529 38.2794V37.1765H27.2559H28.3588V36.0735V34.9706H25.05H21.7412V36.0735V37.1765H22.8441H23.947V38.2794V39.3823H25.05H26.1529V38.2794ZM32.7706 31.6618V30.5588H33.8735H34.9765V29.4559V28.3529H36.0794H37.1823V27.25V26.1471H38.2853H39.3882V25.0441V23.9412H38.2853H37.1823V22.8382V21.7353H36.0794H34.9765V20.6324V19.5294H33.8735H32.7706V18.4265V17.3235H25.05H17.3294V18.4265V19.5294H16.2265H15.1235V20.6324V21.7353H14.0206H12.9176V22.8382V23.9412H11.8147H10.7118V25.0441V26.1471H11.8147H12.9176V27.25V28.3529H14.0206H15.1235V29.4559V30.5588H16.2265H17.3294V31.6618V32.7647H25.05H32.7706V31.6618ZM28.3588 14.0147V12.9118H27.2559H26.1529V11.8088V10.7059H25.05H23.947V11.8088V12.9118H22.8441H21.7412V14.0147V15.1176H25.05H28.3588V14.0147Z" fill="#1BA8CD"/>
<path d="M6.29999 27.25V26.1471H7.40293H8.50587V25.0441V23.9412H9.60881H10.7118V22.8382V21.7353H11.8147H12.9176V20.6324V19.5294H14.0206H15.1235V18.4265V17.3235H12.9176H10.7118V16.2206V15.1176H15.1235H19.5353V14.0147V12.9118H20.6382H21.7412V11.8088V10.7059H22.8441H23.947V9.60294V8.5H25.05H26.1529V9.60294V10.7059H27.2559H28.3588V11.8088V12.9118H29.4618H30.5647V14.0147V15.1176H36.0794H41.5941V16.2206V17.3235H38.2853H34.9765V18.4265V19.5294H36.0794H37.1823V20.6324V21.7353H38.2853H39.3882V22.8382V23.9412H38.2853H37.1823V22.8382V21.7353H36.0794H34.9765V20.6324V19.5294H33.8735H32.7706V18.4265V17.3235H25.05H17.3294V18.4265V19.5294H16.2265H15.1235V20.6324V21.7353H14.0206H12.9176V22.8382V23.9412H11.8147H10.7118V25.0441V26.1471H9.60881H8.50587V27.25V28.3529H7.40293H6.29999V27.25ZM28.3588 14.0147V12.9118H27.2559H26.1529V11.8088V10.7059H25.05H23.947V11.8088V12.9118H22.8441H21.7412V14.0147V15.1176H25.05H28.3588V14.0147Z" fill="#EC6B4E"/>
<path d="M10.7118 33.8677V32.7647H20.6383H30.5647V33.8677V34.9706H20.6383H10.7118V33.8677Z" fill="#5DD39E"/>
<path d="M32.7706 33.8677V32.7647H37.1823H41.5941V33.8677V34.9706H37.1823H32.7706V33.8677Z" fill="#5DD39E"/>
<path d="M23.9471 28.3529V26.1471H22.8441H21.7412V27.25V28.3529H20.6382H19.5353V26.1471V23.9412H25.05H30.5647V27.25V30.5588H27.2559H23.9471V28.3529ZM28.3588 27.25V26.1471H27.2559H26.1529V27.25V28.3529H27.2559H28.3588V27.25Z" fill="#FFCA3A"/>
<path d="M23.9471 20.6324V19.5294H25.05H26.153V20.6324V21.7353H25.05H23.9471V20.6324Z" fill="#FFCA3A"/>
<path d="M10.7118 16.2206V15.1176H14.0206H17.3294V16.2206V17.3235H14.0206H10.7118V16.2206Z" fill="#9DD9D2"/>
<path d="M19.5353 16.2206V15.1176H30.5647H41.5941V16.2206V17.3235H30.5647H19.5353V16.2206Z" fill="#9DD9D2"/>
</svg>
