<svg width="500" height="500" viewBox="0 0 500 500" fill="none" xmlns="http://www.w3.org/2000/svg">
<circle cx="76.5" cy="76.5" r="37.5" fill="#333232"/>
<circle cx="249.5" cy="76.5" r="37.5" fill="#333232"/>
<circle cx="423.5" cy="76.5" r="37.5" fill="#333232"/>
<circle cx="423.5" cy="249.5" r="37.5" fill="#333232"/>
<circle cx="249.5" cy="249.5" r="37.5" fill="#333232"/>
<circle cx="76.5" cy="249.5" r="37.5" fill="#333232"/>
<circle cx="76.5" cy="423.5" r="37.5" fill="#333232"/>
<circle cx="249.5" cy="423.5" r="37.5" fill="#333232"/>
<circle cx="423.5" cy="423.5" r="37.5" fill="#333232"/>
</svg>
