<svg width="36" height="36" viewBox="0 0 36 36" fill="none" xmlns="http://www.w3.org/2000/svg">
<rect x="22.68" y="2.952" width="3.96" height="30.024" rx="1.98" fill="#FFBC42"/>
<rect x="2.88" y="2.952" width="3.96" height="30.024" rx="1.98" fill="#FFBC42"/>
<rect x="8.424" y="32.328" width="3.96" height="9.072" rx="1.98" transform="rotate(-90 8.424 32.328)" fill="#F05D5E"/>
<path d="M10.404 26.424C9.31047 26.424 8.424 25.5375 8.424 24.444V24.444C8.424 23.3505 9.31047 22.464 10.404 22.464H15.516C16.6095 22.464 17.496 23.3505 17.496 24.444V24.444C17.496 25.5375 16.6095 26.424 15.516 26.424H10.404Z" fill="#05A8AA"/>
<rect x="29.232" y="2.952" width="3.96" height="11.16" rx="1.98" fill="#7FB069"/>
</svg>
