 <svg preserveAspectRatio="xMinYMin meet"
                    class="services-menu-item-triangle" width="58px" height="67px"
                    xmlns="http://www.w3.org/2000/svg">
                <path d="M0 0 L26 0 L13 18 L0 0 Z"
                      fill="#18CFAB">
                </path>
            </svg>