﻿62 8 19 98 69 81 25 21 98 99
55 96 67 69 81 43 89 39 22 4
10 96 98 81 35 34 42 53 41 83
22 11 55 10 81 36 98 41 96 30
11 59 49 47 80 83 63 27 79 28
23 83 85 35 24 80 53 62 17 90
56 54 53 7 12 63 83 22 23 23
87 93 5 7 91 63 90 28 37 45
57 53 5 93 90 1 75 7 3 0
85 65 15 71 78 90 46 17 98 40