482.590 136.227 422.991 287.076 241.677 288.822
26.494 329.767 119.558 66.440 321.740 465.721
42.513 495.706 165.439 463.821 112.996 327.628
245.964 409.782 228.778 210.126 444.289 162.979
419.383 135.723 430.702 448.108 163.171 57.508
485.054 97.137 162.662 347.349 131.820 58.775
390.449 448.297 375.045 45.239 83.911 377.238
161.657 291.638 452.035 254.277 313.966 54.640
285.621 223.019 488.509 307.859 361.644 13.829
375.692 299.462 194.146 168.933 77.990 481.988
