447.325 486.781 255.250 75.034 27.937 261.678
334.982 111.871 204.980 318.968 111.501 45.346
165.502 63.959 360.896 216.004 146.020 453.545
159.488 437.982 477.403 364.234 306.698 69.350
478.767 453.530 467.114 118.185 222.881 87.131
489.901 303.373 268.858 176.235 198.782 366.084
307.410 428.154 321.882 97.980 134.907 157.267
26.046 314.729 299.929 268.279 143.497 207.981
314.396 41.792 176.310 385.016 498.652 277.882
420.965 202.951 227.165 453.082 181.406 246.762
