%YAML 1.1
%TAG !u! tag:unity3d.com,2011:
--- !u!114 &11400000
MonoBehaviour:
  m_ObjectHideFlags: 0
  m_CorrespondingSourceObject: {fileID: 0}
  m_PrefabInstance: {fileID: 0}
  m_PrefabAsset: {fileID: 0}
  m_GameObject: {fileID: 0}
  m_Enabled: 1
  m_EditorHideFlags: 0
  m_Script: {fileID: 11500000, guid: 78b3fd9154634ebdb8c8a48960b9a16a, type: 3}
  m_Name: 123
  m_EditorClassIdentifier: 
  NodeLinks:
  - BaseNodeGUID: cd5163c9-2ff0-4cd4-abf7-d783f85d0fe3
    PortName: Next
    TargetNodeGUID: 1075f281-cd44-48b9-8671-4177dd1d7712
  - BaseNodeGUID: 1075f281-cd44-48b9-8671-4177dd1d7712
    PortName: "\u041E\u0442\u0432\u0435\u0442 1"
    TargetNodeGUID: 09a44dbf-8366-4cd9-a8e7-bf49939e9d97
  - BaseNodeGUID: 09a44dbf-8366-4cd9-a8e7-bf49939e9d97
    PortName: "1 \u0432\u0430\u0440\u0438\u0430\u043D\u0442"
    TargetNodeGUID: bad3fe44-04d9-4c33-8052-440c50e3266d
  - BaseNodeGUID: 09a44dbf-8366-4cd9-a8e7-bf49939e9d97
    PortName: "\u0412\u0435\u0440\u043D\u0443\u0442\u044C\u0441\u044F \u0432 \u0441\u0430\u043C\u043E\u0435
      \u043D\u0430\u0447\u0430\u043B\u043E"
    TargetNodeGUID: 1075f281-cd44-48b9-8671-4177dd1d7712
  - BaseNodeGUID: 09a44dbf-8366-4cd9-a8e7-bf49939e9d97
    PortName: "2 \u0432\u0430\u0440\u0438\u0430\u043D"
    TargetNodeGUID: 3bbac1bc-3405-4fdd-8200-4d92cfeba887
  - BaseNodeGUID: ded79a0c-4f22-4fab-9987-9e7389d564a4
    PortName: "1 \u0432\u0430\u0440\u0438\u0430\u043D\u0442"
    TargetNodeGUID: 8115b58c-86c3-4d41-93ad-625de1b4ba37
  - BaseNodeGUID: ded79a0c-4f22-4fab-9987-9e7389d564a4
    PortName: "2 \u0432\u0430\u0440\u0438\u0430\u043D\u0442"
    TargetNodeGUID: e3c83002-5d79-400a-b3cd-74afd044fe53
  - BaseNodeGUID: ded79a0c-4f22-4fab-9987-9e7389d564a4
    PortName: "\u0412\u0435\u0440\u043D\u0443\u0442\u044C\u0441\u044F \u0432 \u043D\u0430\u0447\u0430\u043B\u043E"
    TargetNodeGUID: 1075f281-cd44-48b9-8671-4177dd1d7712
  - BaseNodeGUID: 1075f281-cd44-48b9-8671-4177dd1d7712
    PortName: "\u041E\u0442\u0432\u0435\u0442 2"
    TargetNodeGUID: ded79a0c-4f22-4fab-9987-9e7389d564a4
  DialogueNodeData:
  - NodeGUID: 1075f281-cd44-48b9-8671-4177dd1d7712
    DialogueText: "\u0412\u044B\u0431\u0435\u0440\u0438\u0442\u0435 \u043E\u0442\u0432\u0435\u0442"
    Position: {x: 211, y: 180}
  - NodeGUID: 09a44dbf-8366-4cd9-a8e7-bf49939e9d97
    DialogueText: "\u0412\u044B \u0432\u044B\u0431\u0440\u0430\u043B\u0438 1 \u0432\u0430\u0440\u0438\u0430\u043D\u0442"
    Position: {x: 549, y: -119}
  - NodeGUID: bad3fe44-04d9-4c33-8052-440c50e3266d
    DialogueText: "1 \u0440\u0430\u0437\u0434\u0435\u043B 1 \u0432\u0430\u0440\u0438\u0430\u043D\u0442"
    Position: {x: 1008, y: -311}
  - NodeGUID: 3bbac1bc-3405-4fdd-8200-4d92cfeba887
    DialogueText: "1 \u0440\u0430\u0437\u0434\u0435\u043B 2  \u0432\u0430\u0440\u0438\u0430\u043D\u0442"
    Position: {x: 1022, y: -161}
  - NodeGUID: ded79a0c-4f22-4fab-9987-9e7389d564a4
    DialogueText: "\u0412\u044B \u0432\u044B\u0431\u0440\u0430\u043B\u0438 2 \u0432\u0430\u0440\u0438\u0430\u043D\u0442"
    Position: {x: 560, y: 471}
  - NodeGUID: e3c83002-5d79-400a-b3cd-74afd044fe53
    DialogueText: "2 \u0440\u0430\u0437\u0434\u0435\u043B 2 \u0432\u0430\u0440\u0438\u0430\u043D\u0442"
    Position: {x: 988, y: 621}
  - NodeGUID: 8115b58c-86c3-4d41-93ad-625de1b4ba37
    DialogueText: "2 \u0440\u0430\u0437\u0434\u0435\u043B 1 \u0432\u0430\u0440\u0438\u0430\u043D\u0442"
    Position: {x: 1000, y: 348}
  ExposedProperties:
  - PropertyName: New String
    PropertyValue: ldjsaj;lgdflkg Value
  - PropertyName: New String(1)
    PropertyValue: New Value
  - PropertyName: New String(1)(1)
    PropertyValue: New Value
  - PropertyName: New String(1)(1)(1)
    PropertyValue: 
  - PropertyName: New String(1)(1)(1)(1)
    PropertyValue: New Value
  CommentBlockData: []
