{
    "verbose": true,
    "exec": "node ./server.js",
    "watch": ["server.js", "src/", "utils/"],
    "nodemonConfig": {
        "ignore": [
            "*.test.js"
        ],
        "delay": "2000"
    }
}