Что такое шифрование?
Обратимое преобразование информации для ее сокрытия.

2 вида шифрования
Симметричное и нессиметричное

******************************************************************************
SSL - слой защищенный сокетов

TLS - протокол транспортного уровня
Криптографические протоколы, обеспечивающие защищенную передачу данных.

TLS и SSL используют ассиметричное шифрование для аутентификации
******************************************************************************
7. Application
6. Presentation
5. Session
4. Transport
3. Network
2. Data
1. Physical
******************************************************************************
TLS работает на 6 уровне по модели OSI
******************************************************************************
x.509 - стандарт для сертификатов

Основной формат кодирования для x.509 сертификатов это:
 .der (Distinguished Encoding Rules) - двоичный
 .pem (privacy-enchanced Electronic Mail) - в base64

 PKCS#10 PKCS#12 PKCS#7 - форматы контейнеров

PEM — это текстовое представление реального двоичного ключа или сертификата в формате DER.
Представляет собой двоичного формата DER в кодировке base64 и с дополнительными строками «-----BEGIN PRIVATE KEY-----», «-----BEGIN CERTIFICATE-----» и другими в начале файла и строками
«-----END PRIVATE KEY-----», «-----END CERTIFICATE-----» в конце файла.
******************************************************************************
Мы можем хранить двоичную версию файла только с кодировкой DER, но наиболее распространенным способом является версия PEM.

Вы можете увидеть структуру приватного следующей командой:
openssl rsa -text -in rootCA.key
******************************************************************************
Любой формат ключа на самом деле является контейнером для набора длинных чисел. Все остальные данные можно считать «шумом».

Закрытый ключ содержит: модуль (modulus), частный показатель (privateExponent), открытый показатель (publicExponent), простое число 1 (prime1), простое число 2 (prime2), показатель степени 1 (exponent1), показатель степени 2 (exponent2) и коэффициент (coefficient).

Открытый ключ содержит только модуль (modulus) и открытый показатель (publicExponent).

Вы можете из влечь из файла ключей публичный ключ:

openssl rsa -in rootCA.key -pubout -out rootCA-public.key
По умолчанию выводится закрытый ключ: с опцией -pubout вместо него будет выведен открытый ключ. Эта опция устанавливается автоматически, если ввод является открытым ключом.
******************************************************************************
Следующая команда покажет информацию о публичном ключе:
openssl rsa -text -in rootCA-public.key -pubin
По умолчанию из входного файла считывается закрытый ключ. Используемая в предыдущей команде опция -pubin делает так, что вместо приватного ключа читается открытый ключ.
Можно также добавить опцию -noout — с ней будет выведена та же самая информация, но не будет показана кодированная версия ключа.

openssl rsa -text -in rootCA-public.key -pubin -noout
С такими же опциями, но уже используя команду req, можно изучить содержимое запроса на подпись сертификата:

openssl req -in mydomain.com.csr -noout -text
******************************************************************************

******************************************************************************

******************************************************************************

******************************************************************************

******************************************************************************

******************************************************************************

******************************************************************************

******************************************************************************

******************************************************************************

******************************************************************************

******************************************************************************

******************************************************************************

******************************************************************************

******************************************************************************

******************************************************************************

******************************************************************************

******************************************************************************

******************************************************************************

******************************************************************************

******************************************************************************

******************************************************************************

******************************************************************************

******************************************************************************

******************************************************************************

******************************************************************************

******************************************************************************

******************************************************************************

******************************************************************************

******************************************************************************

******************************************************************************

******************************************************************************

******************************************************************************

******************************************************************************

******************************************************************************

******************************************************************************

******************************************************************************

******************************************************************************

******************************************************************************

******************************************************************************

******************************************************************************

******************************************************************************

******************************************************************************

******************************************************************************

******************************************************************************

******************************************************************************

******************************************************************************

******************************************************************************

******************************************************************************

******************************************************************************

******************************************************************************

******************************************************************************

******************************************************************************

******************************************************************************

******************************************************************************

******************************************************************************

******************************************************************************

******************************************************************************

******************************************************************************

******************************************************************************

******************************************************************************

******************************************************************************

******************************************************************************

******************************************************************************

******************************************************************************

******************************************************************************

******************************************************************************

******************************************************************************

******************************************************************************

******************************************************************************

******************************************************************************

******************************************************************************

******************************************************************************

******************************************************************************

******************************************************************************

******************************************************************************

******************************************************************************

******************************************************************************

******************************************************************************

******************************************************************************

******************************************************************************

******************************************************************************

******************************************************************************

******************************************************************************

******************************************************************************

******************************************************************************

******************************************************************************

******************************************************************************

******************************************************************************

******************************************************************************

******************************************************************************

******************************************************************************

******************************************************************************

******************************************************************************

******************************************************************************

******************************************************************************

******************************************************************************

******************************************************************************