C:\Users\Максим\Downloads\Practice\notify-app\server\src\main\java\CRUD\Console.java
C:\Users\Максим\Downloads\Practice\notify-app\server\src\main\java\MyParser\Parser.java
C:\Users\Максим\Downloads\Practice\notify-app\server\src\main\java\MyParser\redditParser.java
C:\Users\Максим\Downloads\Practice\notify-app\server\src\main\java\MySQL_interactions\interactors.java
C:\Users\Максим\Downloads\Practice\notify-app\server\src\main\java\MyParser\BasicTypes\Source.java
C:\Users\Максим\Downloads\Practice\notify-app\server\src\main\java\CRUD\Notify.java
C:\Users\Максим\Downloads\Practice\notify-app\server\src\main\java\MySQL_interactions\getters.java
C:\Users\Максим\Downloads\Practice\notify-app\server\src\main\java\MyParser\vc_parser.java
C:\Users\Максим\Downloads\Practice\notify-app\server\src\main\java\MyParser\vk_parser.java
C:\Users\Максим\Downloads\Practice\notify-app\server\src\main\java\Server_Interactions\JsonCreator.java
C:\Users\Максим\Downloads\Practice\notify-app\server\src\main\java\Main.java
C:\Users\Максим\Downloads\Practice\notify-app\server\src\main\java\MyParser\BasicTypes\News.java
