Название команды,Дивизион,Суммарный рассчитанный рейтинг основного состава по регламенту (в цифрах),Никнейм 1 игрока,Ссылка на OP.GG,"Ссылки на OP.GG дополнительных аккаунтов, если таковые имеются",Ссылка на страницу VK,Рассчитанный рейтинг (в цифрах и далее так же),Никнейм 2 игрока,Ссылка на OP.GG,"Ссылки на OP.GG дополнительных аккаунтов, если таковые имеются",Ссылка на страницу VK,Рассчитанный рейтинг,Никнейм 3 игрока,Ссылка на OP.GG,"Ссылки на OP.GG дополнительных аккаунтов, если таковые имеются",Ссылка на страницу VK,Рассчитанный рейтинг,Никнейм 4 игрока,Ссылка на OP.GG,"Ссылки на OP.GG дополнительных аккаунтов, если таковые имеются",Ссылка на страницу VK,Рассчитанный рейтинг,Никнейм 5 игрока,Ссылка на OP.GG,"Ссылки на OP.GG дополнительных аккаунтов, если таковые имеются",Ссылка на страницу VK,Рассчитанный рейтинг,Никнейм 6 игрока,Ссылка на OP.GG,"Ссылки на OP.GG дополнительных аккаунтов, если таковые имеются",Ссылка на страницу VK,Рассчитанный рейтинг,Никнейм 7 игрока,Ссылка на OP.GG,"Ссылки на OP.GG дополнительных аккаунтов, если таковые имеются",Ссылка на страницу VK,Рассчитанный рейтинг,Никнейм 8 игрока,Ссылка на OP.GG,"Ссылки на OP.GG дополнительных аккаунтов, если таковые имеются",Ссылка на страницу VK,Рассчитанный рейтинг,Никнейм 9 игрока,Ссылка на OP.GG,"Ссылки на OP.GG дополнительных аккаунтов, если таковые имеются",Ссылка на страницу VK,Рассчитанный рейтинг,Никнейм 10 игрока,Ссылка на OP.GG,"Ссылки на OP.GG дополнительных аккаунтов, если таковые имеются",Ссылка на страницу VK,Рассчитанный рейтинг
FENNECS,Средний,9300,TheSinsFlower,https://ru.op.gg/summoner/userName=TheSinsFlower,,https://vk.com/id503113702,2200,KirlxZ,https://ru.op.gg/summoner/userName=KirlxZ,,https://vk.com/kirlxz,1800,nekemakil,https://ru.op.gg/summoner/userName=nekemakil,,https://vk.com/andarion,1500,Lumuhulucuk,https://ru.op.gg/summoner/userName=Lumuhulucuk,,https://vk.com/lumuhulu,1800,orierrr,https://ru.op.gg/summoner/?userName=orierrr,,https://vk.com/id122001205,2000,тИГРИВЫЙпледя,https://ru.op.gg/summoner/userName=тИГРИВЫЙпледя,,https://vk.com/alvriko_pled,1500,,,,,,,,,,,,,,,,,,,,
BIG Russian Floppa,Старший,11200,Dumbest,https://ru.op.gg/summoner/userName=Dumb%D0%B5st,https://euw.op.gg/summoner/userName=Leaving+Jesus,https://vk.com/yngvostokh,2000,Гламурный лемур,https://ru.op.gg/summoner/userName=%D0%93%D0%BB%D0%B0%D0%BC%D1%83%D1%80%D0%BD%D1%8B%D0%B9+%D0%BB%D0%B5%D0%BC%D1%83%D1%80,,https://vk.com/ann.velichko99,2100,NO EGO FOR ELO,https://ru.op.gg/summoner/userName=NO+EGO+FOR+ELO,https://euw.op.gg/summoner/userName=Ryltar+VI,https://vk.com/windfromthewoods,3000,DixenFive,https://ru.op.gg/summoner/userName=DixenFive,,https://vk.com/dixenfive,2000,SyBuLy,https://ru.op.gg/summoner/userName=SyBuLy,https://ru.op.gg/summoner/userName=Kinario,https://vk.com/id295214902,2100,lilikLegend,https://ru.op.gg/summoner/userName=lilikLegend,,https://vk.com/id444617325,2100,Крадя,https://ru.op.gg/summoner/userName=%D0%9A%D1%80%D0%B0%D0%B4%D1%8F,,https://vk.com/yungkradya,2200,,,,,,,,,,,,,,,
CrazySpinners ,Старший,12600,CrazyHoD,https://ru.op.gg/summoner/userName=CrazyHoD,https://ru.op.gg/summoner/userName=Burning+Turtle,https://vk.com/lordglog,2600,SamAt5Am,https://ru.op.gg/summoner/userName=SamAt5Am,https://ru.op.gg/summoner/userName=Burning%20Turtle,https://vk.com/alex.nikulin,2300,CrazyMawerik,https://ru.op.gg/summoner/userName=CrazyMawerik,https://euw.op.gg/summoner/userName=Mawerik,https://vk.com/raspertov_pavel,2200,CrazyBjorn,https://ru.op.gg/summoner/userName=CrazyBjorn,https://ru.op.gg/summoner/userName=AkioDM,https://vk.com/plehanovsergey,3000,CrazyDenny,https://ru.op.gg/summoner/userName=CrazyDenny,,https://vk.com/marttlet,2500,Danriskus ,https://ru.op.gg/summoner/userName=Danriskus+,,https://vk.com/id48540782,2200,CrazyHentai,https://ru.op.gg/summoner/userName=%D0%9A%D0%B0%D0%BF%D0%B8%D1%82%D0%B0%D0%BD+%D0%9A%D1%8D%D0%BF,,https://vk.com/flintok777,2700,stormchaser0204,https://www.leagueofgraphs.com/summoner/ru/StormChaser0204,,https://vk.com/stormchaser0204,3000,Vеgа,https://www.leagueofgraphs.com/summoner/ru/V%D0%B5g%D0%B0,,https://vk.com/oni.vega,2700,WhiteClaws,https://www.leagueofgraphs.com/summoner/ru/WhiteClaws,https://www.leagueofgraphs.com/summoner/euw/Gredt,https://vk.com/mrexidha,2600
Elo Bibika,Старший,12700,Akagi,https://ru.op.gg/summoner/userName=Akagi,https://ru.op.gg/summoner/?userName=rylaime,https://vk.com/ghoduck,2600,MagnusSam,https://ru.op.gg/summoner/userName=MagnusSam,,https://vk.com/necroviva,2600,Step Jg Im Stuck,https://ru.op.gg/summoner/userName=Step%20Jg%20im%20stuck,,https://vk.com/yebokvlesy,2700,Micuro,https://ru.op.gg/summoner/userName=Micuro,,https://vk.com/micuro2,2500,,,,,,,,,,,Xenovia Paradise,https://ru.op.gg/summoner/userName=Xenovia+Paradise,https://ru.op.gg/summoner/userName=T1+Clozer,https://vk.com/xambaramatsu,2500,Schizophasia,https://ru.op.gg/summoner/?userName=Schizophasia,,https://vk.com/agamaggan,2000,,,,,,,,,,
ПСЖ ТАЛОНЫ,Старший,11300,fencetvodila,https://ru.op.gg/summoner/userName=fencetvodila,,https://vk.com/chupachuchelo1488,2600,Даун на зеде,https://ru.op.gg/summoner/userName=Даун+на+зеде,,https://vk.com/konchza0,2600,FLEXXXER777,https://ru.op.gg/summoner/userName=FLEXXXER777,,https://vk.com/krolikvalakas,2300,GRAFQXD,https://ru.op.gg/summoner/userName=GRAFQXD,,https://vk.com/id556667927,2100,FFOuur,https://ru.op.gg/summoner/userName=FFOuur,https://ru.op.gg/summoner/userName=ADC+BoBeR,,2200,HANZ0SHINOBI  ,https://ru.op.gg/summoner/userName=HANZ0SHINOBI,,,2200,,,,,,,,,,,,,,,,,,,,
SilverLight,Cредний,6700,TecPan,https://ru.op.gg/summoner/userName=TecPan,https://ru.op.gg/summoner/userName=TecPet ,https://vk.com/id557814701,2400,LeGeNDS,https://ru.op.gg/summoner/userName=LeGeNDS,https://euw.op.gg/summoner/userName=JoJoReferench,https://vk.com/zloy_voodoo,1500,SovaRus,https://ru.op.gg/summoner/userName=SovaRus,https://euw.op.gg/summoner/userName=SovaRus,https://vk.com/id460773653,1500,snowman99,https://ru.op.gg/summoner/userName=snowman99,,https://vk.com/id471356878,1500,Alkgoolia,https://ru.op.gg/summoner/userName=Alkogolia,,https://vk.com/olia_yuferova,1500,,,,,,,,,,,,,,,,,,,,,,,,,
Туалетные аналитики ,Средний,9600,Kraiwyt,https://ru.op.gg/summoner/userName=Kraiwyt,,https://vk.com/tolmachev_seva,2100,ich1schlange,https://ru.op.gg/summoner/userName=ich1schlange,,https://vk.com/ich_schlange,1500,Pukirori,https://ru.op.gg/summoner/userName=Pukirori,,,2100,Gildo,https://ru.op.gg/summoner/userName=Gildo,,https://vk.com/mihaman1o1,2200,RPC StenBunl,https://ru.op.gg/summoner/userName=RPC+StenBunl,,https://vk.com/stenbunl,1700,,,,,,,,,,,,,,,,,,,,,,,,,
Random Crew Junior,Средний,9300,Akotan,https://ru.op.gg/summoner/userName=Akotan+,,,1700,kilook ,https://www.leagueofgraphs.com/summoner/ru/kilook,,,2200,VeganThug,https://ru.op.gg/summoner/userName=VeganThug,,,2100,Katori0 ,https://ru.op.gg/summoner/userName=Katori0+,,,1500,дисбактериоз ,https://ru.op.gg/summoner/userName=дисбактериоз,,,1800,,,,,,,,,,,,,,,,,,,,,,,,,
Saga of Potato,Старший,11300,Hasuo,https://ru.op.gg/summoner/?userName=Hasuo,,https://vk.com/mprokhorov2015,2500,tikvadom,https://ru.op.gg/summoner/?userName=tikvadom,,https://vk.com/tikvadom,2200,Дмитрий54,https://ru.op.gg/summoner/userName=Дмитрий54,,https://vk.com/dmitrui54,2200,PersEXE,https://ru.op.gg/summoner/userName=PersEXE,,https://vk.com/id520481885,2300,MoOnkassss,https://ru.op.gg/summoner/?userName=MoOnkassss,,https://vk.com/moonkasss,2100,Gormir71,https://ru.op.gg/summoner/userName=Gormir71,,https://vk.com/gormir71,2300,OtakuHikari,https://ru.op.gg/summoner/?userName=OtakuHikari,https://ru.op.gg/summoner/?userName=%D0%A1B%D0%98%D0%9D%D0%93%D0%95%D0%A0+%D0%9F%D0%AD%D0%9F%D0%90,https://vk.com/dot_png_blin,2000,,,,,,,,,,,,,,,
Радиоактивные Люди,Старший,13000,Son Of Barnaul,https://www.leagueofgraphs.com/ru/summoner/ru/SON+OF+BARNAUL,https://www.leagueofgraphs.com/ru/summoner/ru/FlashOut,https://vk.com/flash0ut,3000,Lilitaniel,https://www.leagueofgraphs.com/ru/summoner/ru/Lilitaniel,,https://vk.com/tosha_ndra,2800,Łilith,https://www.leagueofgraphs.com/ru/summoner/ru/%C5%81ilith,,https://vk.com/lilithbyak,3000,Bеnriya,https://www.leagueofgraphs.com/ru/summoner/ru/B%D0%B5nriya,,,2100,PROBIGCÜMABUSER,https://ru.op.gg/summoner/userName=ProbigcÜmabuser,-,https://vk.com/settthebosse,2100,,,,,,,,,,,,,,,,,,,,,,,,,
Random Crew Blue,Старший,11800,Cactus Jack,https://ru.op.gg/summoner/userName=cactusJack,,,2300,Pr0gramma,https://ru.op.gg/summoner/userName=Pr0gramma+,,,2300,RoN46,https://ru.op.gg/summoner/userName=RoN46,,https://vk.com/63ron_46,2200,Shikito,https://ru.op.gg/summoner/userName=Shikito+,,,3000,BelkanRawr ,https://ru.op.gg/summoner/userName=BelkanRawr+,,,2000,AloneMemoryy,https://ru.op.gg/summoner/userName=AloneMemoryy+,,,2000,,,,,,,,,,,,,,,,,,,,
Baby Sharks,Средний,10400,PandoraADM,https://ru.op.gg/summoner/userName=PandoraADM,,https://vk.com/pandorabox1,1600,d0ntlook,https://ru.op.gg/summoner/userName=d0ntlook,,https://vk.com/uber_dog,2200,Мефистофель,https://ru.op.gg/summoner/userName=Мефистофель,https://ru.op.gg/summoner/userName=KH0nKa,https://vk.com/kira1an,2200,Трусы Браума,https://ru.op.gg/summoner/userName=Трусы%20Браума,https://ru.op.gg/summoner/userName=RaWehnWhite,https://vk.com/venyok6oi,2200,SadbaSOni,https://ru.op.gg/summoner/userName=SadbaSOni,,https://vk.com/id155260069,2200,Гром Кринжира,https://ru.op.gg/summoner/userName=Гром+Кринжира,,https://vk.com/caha245,1700,Ereshkigal,https://ru.op.gg/summoner/userName=Ereshkigal,,https://vk.com/lloyd_vega,2150,BOBRISSIMO,https://ru.op.gg/summoner/userName=BOBRISSIMO,,https://vk.com/veselov_daniil,2100,YoakeMegitsune,https://ru.op.gg/summoner/userName=YoakeMegitsune,,https://vk.com/onetiredfox,1800,СестренкаНеТуда,https://ru.op.gg/summoner/userName=СестренкаНеТуда,,https://vk.com/id251193778,1500
Coinflippers,Старший,11950,Dubok1122,https://ru.op.gg/summoner/?userName=dubok1122,,https://vk.com/imdiedsry,2000,YourDarling,https://ru.op.gg/summoner/?userName=YourDarling,,https://vk.com/id446701734,2150,DeGeneral,https://ru.op.gg/summoner/?userName=DeGeneral,,https://vk.com/ptaxh_my_god,2650,sharman,https://ru.op.gg/summoner/?userName=sharman,,https://vk.com/ves_mir_protiv_menya,3100,FairyKing,https://www.leagueofgraphs.com/summoner/ru/FairyKing,,,2000,,,,,,,,,,,,,,,,,,,,,,,,,
Random Crew Red,Старший,11700,krabik2000 ,https://ru.op.gg/summoner/userName=krabik2000+,,,2000,Ваton ,https://ru.op.gg/summoner/userName=Ваton+,,,2500,DefinitelyXPeke ,https://ru.op.gg/summoner/userName=DefinitelyXPeke+,,,2500,L1MB0S1335  ,https://ru.op.gg/summoner/userName=L1MB0S1335+,,https://vk.com/viegomeiner ,2200,UncleBells ,https://ru.op.gg/summoner/userName=UncleBells+,,https://vk.com/vballzadrot,2500,FaL7en ,https://ru.op.gg/summoner/userName=FaL7en+,,,2000,CpaK0gep ,https://ru.op.gg/summoner/userName=CpaK0gep+,,,2000,ARTsasha,https://ru.op.gg/summoner/userName=ArtSasha+,,,2500,,,,,,,,,,
Dark Valkyrie's,Средний,9300,King Gojo,https://ru.op.gg/summoner/userName=King%20Gojo,,https://vk.com/kristan_bax,2200,King Sukuna,https://ru.op.gg/summoner/userName=King%20Sukuna,,https://vk.com/yanulyaaaaayang,1500,gwendolineYU,https://ru.op.gg/summoner/userName=gwendolineYU,,https://vk.com/gwen_yu,2000,LoraLoliwe,https://ru.op.gg/summoner/userName=LoraLoliwe,,https://vk.com/dilcost,2000,H Ä X B L O D,https://ru.op.gg/summoner/userName=H%20%C3%84%20X%20B%20L%20O%20D,,https://vk.com/id189807684,1600,Влажные салфетки ,https://ru.op.gg/summoner/userName=Влажные%20салфетки,,https://vk.com/id655023012,2000,,,,,,,,,,,,,,,,,,,,
Coinflippers,Средний,10100,I1ust,https://ru.op.gg/summoner/userName=I1ust,https://euw.op.gg/summoner/userName=I1ust,https://vk.com/id352250397,1700,Бухляшка,https://ru.op.gg/summoner/userName=Бухляшка,,https://vk.com/id250621782,2600,kapusto4ka,https://ru.op.gg/summoner/userName=kapusto4ka,,https://vk.com/mr.kapusto4ka,2000,Diglomanich,https://ru.op.gg/summoner/userName=Diglomanich,,https://vk.com/diglomanich,1800,ArtyGrey,https://ru.op.gg/summoner/userName=ArtyGrey,,https://vk.com/danililgizovich,2000,Mirdan4ik,https://ru.op.gg/summoner/userName=Mirdan4ik,,https://vk.com/damkor,1550,Zhongow,https://ru.op.gg/summoner/userName=Zhongow,,https://vk.com/zhongkuy,1500,topoliniypuh,https://ru.op.gg/summoner/userName=topoliniypuh,,https://vk.com/litl.frog,1700,RyzenTime,https://ru.op.gg/summoner/userName=RyzenTime,,https://vk.com/kskskskskskskskk,2100,,,,,
SwinoBrothers ,Старший,12700,Gargulia,https://ru.op.gg/summoner/userName=gargulia,,https://vk.com/milayths,2200,SophTon1k,https://ru.op.gg/summoner/userName=SophTon1k,,https://vk.com/justtonik,2800,BloоdRaven,https://ru.op.gg/summoner/userName=Blo%D0%BEdRaven,,https://vk.com/id283092608,2700,BELL44,https://ru.op.gg/summoner/userName=BELL44,,https://vk.com/id85218857,2000,Vatrushka,https://ru.op.gg/summoner/userName=vatrushka,,https://vk.com/milayths,3000,,,,,,,,,,,,,,,,,,,,,,,,,
Oh no cringe,Средний,8600,Sept1cim,https://ru.op.gg/summoner/userName=sept1cim,,https://vk.com/sept1cim,1700,rx1ress,https://ru.op.gg/summoner/userName=rx1ress,,https://vk.com/rxtress,1700,Akinetsu,https://ru.op.gg/summoner/userName=Akinetsu,,https://vk.com/akinetsu,1700,arkada1a,https://ru.op.gg/summoner/userName=arkada1a,,https://vk.com/xmxterxsu,1700,h1ggs,https://ru.op.gg/summoner/userName=h1ggs,,https://vk.com/sadwayne,2050,Dryuny4,https://ru.op.gg/summoner/userName=Dryuny4,,https://vk.com/dryuny4,1600,,,,,,,,,,,,,,,,,,,,