%YAML 1.1
%TAG !u! tag:unity3d.com,2011:
--- !u!114 &11400000
MonoBehaviour:
  m_ObjectHideFlags: 0
  m_CorrespondingSourceObject: {fileID: 0}
  m_PrefabInstance: {fileID: 0}
  m_PrefabAsset: {fileID: 0}
  m_GameObject: {fileID: 0}
  m_Enabled: 1
  m_EditorHideFlags: 0
  m_Script: {fileID: 11500000, guid: 9f0b665bbfc44e3bbf8a0204d88137dd, type: 3}
  m_Name: ice_Tile
  m_EditorClassIdentifier: 
  m_Sprite: {fileID: 21300000, guid: 515f08ff10662784e8caea71ce83b4bf, type: 3}
  m_Color: {r: 0, g: 0.00002193451, b: 1, a: 1}
  m_Transform:
    e00: 1
    e01: 0
    e02: 0
    e03: 0
    e10: 0
    e11: 1
    e12: 0
    e13: 0
    e20: 0
    e21: 0
    e22: 1
    e23: 0
    e30: 0
    e31: 0
    e32: 0
    e33: 1
  m_InstancedGameObject: {fileID: 0}
  m_Flags: 1
  m_ColliderType: 1
  type: 1
  constructorSpriteOverride: {fileID: 0}
  isConstant: 0
