%YAML 1.1
%TAG !u! tag:unity3d.com,2011:
--- !u!114 &11400000
MonoBehaviour:
  m_ObjectHideFlags: 0
  m_CorrespondingSourceObject: {fileID: 0}
  m_PrefabInstance: {fileID: 0}
  m_PrefabAsset: {fileID: 0}
  m_GameObject: {fileID: 0}
  m_Enabled: 1
  m_EditorHideFlags: 0
  m_Script: {fileID: 11500000, guid: 186b39e85a824f56a18456f032b980b2, type: 3}
  m_Name: LongRun_DistanceAch
  m_EditorClassIdentifier: 
  title: Long Run
  description: Run 1000 meters
  id: 2
  rewardSize: 23
  image: {fileID: 21300006, guid: 1eaee135ce037439d925cee5e41ce026, type: 3}
  rewardImage: {fileID: 21300042, guid: 1eaee135ce037439d925cee5e41ce026, type: 3}
  goal: 100
