%YAML 1.1
%TAG !u! tag:unity3d.com,2011:
--- !u!114 &11400000
MonoBehaviour:
  m_ObjectHideFlags: 0
  m_CorrespondingSourceObject: {fileID: 0}
  m_PrefabInstance: {fileID: 0}
  m_PrefabAsset: {fileID: 0}
  m_GameObject: {fileID: 0}
  m_Enabled: 1
  m_EditorHideFlags: 0
  m_Script: {fileID: 11500000, guid: 770e441402234868a4087243683fc7fe, type: 3}
  m_Name: Golden Madness_Coins Ach
  m_EditorClassIdentifier: 
  title: Golden Madness
  description: Collect 25 coins
  id: 3
  rewardSize: 55
  image: {fileID: 21300012, guid: 1eaee135ce037439d925cee5e41ce026, type: 3}
  rewardImage: {fileID: 21300042, guid: 1eaee135ce037439d925cee5e41ce026, type: 3}
  goal: 25
