%YAML 1.1
%TAG !u! tag:unity3d.com,2011:
--- !u!114 &11400000
MonoBehaviour:
  m_ObjectHideFlags: 0
  m_CorrespondingSourceObject: {fileID: 0}
  m_PrefabInstance: {fileID: 0}
  m_PrefabAsset: {fileID: 0}
  m_GameObject: {fileID: 0}
  m_Enabled: 1
  m_EditorHideFlags: 0
  m_Script: {fileID: 11500000, guid: a77f8cb5bc4a42e98b3511d391da0c79, type: 3}
  m_Name: ButtonClick
  m_EditorClassIdentifier: 
  _key: Button
  _isLooped: 0
  _isOneAtTime: 0
  _audioClip: {fileID: 8300000, guid: 99348d26b121bdf40bca2ff30b000207, type: 3}
