%YAML 1.1
%TAG !u! tag:unity3d.com,2011:
--- !u!114 &11400000
MonoBehaviour:
  m_ObjectHideFlags: 0
  m_CorrespondingSourceObject: {fileID: 0}
  m_PrefabInstance: {fileID: 0}
  m_PrefabAsset: {fileID: 0}
  m_GameObject: {fileID: 0}
  m_Enabled: 1
  m_EditorHideFlags: 0
  m_Script: {fileID: 11500000, guid: 96888b435ccd4b0687ab4fbf05645346, type: 3}
  m_Name: BonusesParameters
  m_EditorClassIdentifier: 
  magnetRadius: 5
  scoreBoostValue: 2
  magnetInitialLifeTime: 7
  scoreBoostInitialLifeTime: 10
  shieldInitialLifeTime: 6
  _soundOnPickupKey: Bonus
