%YAML 1.1
%TAG !u! tag:unity3d.com,2011:
--- !u!114 &11400000
MonoBehaviour:
  m_ObjectHideFlags: 0
  m_CorrespondingSourceObject: {fileID: 0}
  m_PrefabInstance: {fileID: 0}
  m_PrefabAsset: {fileID: 0}
  m_GameObject: {fileID: 0}
  m_Enabled: 1
  m_EditorHideFlags: 0
  m_Script: {fileID: 11500000, guid: d3ad1a82f4db4f50b7b00f0cf3c51884, type: 3}
  m_Name: SurvivorMale_CharacterItemData
  m_EditorClassIdentifier: 
  characterSkinTexture: {fileID: 2800000, guid: aebb532dd9bbb7d458f971f471d03afa, type: 3}
