%YAML 1.1
%TAG !u! tag:unity3d.com,2011:
--- !u!114 &11400000
MonoBehaviour:
  m_ObjectHideFlags: 0
  m_CorrespondingSourceObject: {fileID: 0}
  m_PrefabInstance: {fileID: 0}
  m_PrefabAsset: {fileID: 0}
  m_GameObject: {fileID: 0}
  m_Enabled: 1
  m_EditorHideFlags: 0
  m_Script: {fileID: 11500000, guid: f8fda4af75154dc289c4cfd802fd9322, type: 3}
  m_Name: SkaterFemale_CharacterShopItemModel 1
  m_EditorClassIdentifier: 
  _id: 6
  _price: 50
  _name: Skater Female
  _image: {fileID: 21300000, guid: 4dd1b9c92869cfe479de9523a6ff8785, type: 3}
  characterItemData: {fileID: 11400000, guid: cea04c36cd538534eb6915218d4444dd, type: 2}
