%YAML 1.1
%TAG !u! tag:unity3d.com,2011:
--- !u!114 &11400000
MonoBehaviour:
  m_ObjectHideFlags: 0
  m_CorrespondingSourceObject: {fileID: 0}
  m_PrefabInstance: {fileID: 0}
  m_PrefabAsset: {fileID: 0}
  m_GameObject: {fileID: 0}
  m_Enabled: 1
  m_EditorHideFlags: 0
  m_Script: {fileID: 11500000, guid: af10e5ca1b804c1194f617ca23fc8ba4, type: 3}
  m_Name: Donut_RareBossData
  m_EditorClassIdentifier: 
  skin: {fileID: 21300000, guid: 448cf62429f3e1e45bd53056cff63e1e, type: 3}
  rewardKnife: {fileID: 11400000, guid: 4287d22ac0ea6694d9ba936b623e5b43, type: 2}
  stumpConfiguration: {fileID: 11400000, guid: 659ae8144175a61458a82906327e58e0, type: 2}
  bossRarity: 1
