%YAML 1.1
%TAG !u! tag:unity3d.com,2011:
--- !u!114 &11400000
MonoBehaviour:
  m_ObjectHideFlags: 0
  m_CorrespondingSourceObject: {fileID: 0}
  m_PrefabInstance: {fileID: 0}
  m_PrefabAsset: {fileID: 0}
  m_GameObject: {fileID: 0}
  m_Enabled: 1
  m_EditorHideFlags: 0
  m_Script: {fileID: 11500000, guid: 855c912742ac41d684f4b24c8fcccab5, type: 3}
  m_Name: 8_KnifeItemData
  m_EditorClassIdentifier: 
  knifeSkin: {fileID: 21300000, guid: ac7ad0d0117aea3418215cbf7e85953b, type: 3}
