%YAML 1.1
%TAG !u! tag:unity3d.com,2011:
--- !u!114 &11400000
MonoBehaviour:
  m_ObjectHideFlags: 0
  m_CorrespondingSourceObject: {fileID: 0}
  m_PrefabInstance: {fileID: 0}
  m_PrefabAsset: {fileID: 0}
  m_GameObject: {fileID: 0}
  m_Enabled: 1
  m_EditorHideFlags: 0
  m_Script: {fileID: 11500000, guid: 4e58b8f28eb34d48a3c651aebd0755cc, type: 3}
  m_Name: 1_KnifeShopItemModel
  m_EditorClassIdentifier: 
  _id: 1
  _price: 5
  _image: {fileID: 21300000, guid: 5eac1aa8a46578043823f42bea282392, type: 3}
  _rarity: 0
  knifeItemData: {fileID: 11400000, guid: 19d11f9755a939644bff9d4baa5535d2, type: 2}
