%YAML 1.1
%TAG !u! tag:unity3d.com,2011:
--- !u!114 &11400000
MonoBehaviour:
  m_ObjectHideFlags: 0
  m_CorrespondingSourceObject: {fileID: 0}
  m_PrefabInstance: {fileID: 0}
  m_PrefabAsset: {fileID: 0}
  m_GameObject: {fileID: 0}
  m_Enabled: 1
  m_EditorHideFlags: 0
  m_Script: {fileID: 11500000, guid: af10e5ca1b804c1194f617ca23fc8ba4, type: 3}
  m_Name: Tomato_CommonBoss 1
  m_EditorClassIdentifier: 
  skin: {fileID: 21300000, guid: 345c47786b718f24182071adba57ee0b, type: 3}
  rewardKnife: {fileID: 11400000, guid: 3dd82fe383b266740be5eb9e706c5a2d, type: 2}
  stumpConfiguration: {fileID: 11400000, guid: 9ef87fadddd26cb41b77c332606d327d, type: 2}
  bossRarity: 0
