%YAML 1.1
%TAG !u! tag:unity3d.com,2011:
--- !u!114 &11400000
MonoBehaviour:
  m_ObjectHideFlags: 0
  m_CorrespondingSourceObject: {fileID: 0}
  m_PrefabInstance: {fileID: 0}
  m_PrefabAsset: {fileID: 0}
  m_GameObject: {fileID: 0}
  m_Enabled: 1
  m_EditorHideFlags: 0
  m_Script: {fileID: 11500000, guid: a7932f2df7e646c388a2500ff80d0f4f, type: 3}
  m_Name: DefaultDashStumpConfiguration
  m_EditorClassIdentifier: 
  _config:
    angle: 90
    time: 2.1
    direction: 1
