%YAML 1.1
%TAG !u! tag:unity3d.com,2011:
--- !u!114 &11400000
MonoBehaviour:
  m_ObjectHideFlags: 0
  m_CorrespondingSourceObject: {fileID: 0}
  m_PrefabInstance: {fileID: 0}
  m_PrefabAsset: {fileID: 0}
  m_GameObject: {fileID: 0}
  m_Enabled: 1
  m_EditorHideFlags: 0
  m_Script: {fileID: 11500000, guid: 4e58b8f28eb34d48a3c651aebd0755cc, type: 3}
  m_Name: 4_KnifeShopItemModel
  m_EditorClassIdentifier: 
  _id: 4
  _price: 15
  _image: {fileID: 21300000, guid: 0e9dabf7e1a8cf4459b104f3e7f983af, type: 3}
  _rarity: 0
  knifeItemData: {fileID: 11400000, guid: 303ca611699e68f4eaf8f9a6b5a71e55, type: 2}
