%YAML 1.1
%TAG !u! tag:unity3d.com,2011:
--- !u!114 &11400000
MonoBehaviour:
  m_ObjectHideFlags: 0
  m_CorrespondingSourceObject: {fileID: 0}
  m_PrefabInstance: {fileID: 0}
  m_PrefabAsset: {fileID: 0}
  m_GameObject: {fileID: 0}
  m_Enabled: 1
  m_EditorHideFlags: 0
  m_Script: {fileID: 11500000, guid: e3e8f9843f2d4874bcb531be5f378075, type: 3}
  m_Name: ItemsStorage
  m_EditorClassIdentifier: 
  items:
  - {fileID: 11400000, guid: c56d1f8e6cc3c124d8f0b2e69ea82445, type: 2}
  - {fileID: 11400000, guid: 4dbf9b1bd0ed1e9488ad90a2863b895d, type: 2}
  - {fileID: 11400000, guid: 1e4c27cf363b1b74b8e0613c3a2955d7, type: 2}
  - {fileID: 11400000, guid: 65550ccbd843f4643b65dab33fcc0ac6, type: 2}
  - {fileID: 11400000, guid: 0c82a5bc0b3721e48b86f008d201005d, type: 2}
  - {fileID: 11400000, guid: ff5e939faba58774d85cf2884d904e90, type: 2}
