%YAML 1.1
%TAG !u! tag:unity3d.com,2011:
--- !u!1 &183896878367531070
GameObject:
  m_ObjectHideFlags: 0
  m_CorrespondingSourceObject: {fileID: 0}
  m_PrefabInstance: {fileID: 0}
  m_PrefabAsset: {fileID: 0}
  serializedVersion: 6
  m_Component:
  - component: {fileID: 5447525347037022395}
  - component: {fileID: 4024110099235763077}
  m_Layer: 0
  m_Name: SpawnManager
  m_TagString: Untagged
  m_Icon: {fileID: 0}
  m_NavMeshLayer: 0
  m_StaticEditorFlags: 0
  m_IsActive: 1
--- !u!4 &5447525347037022395
Transform:
  m_ObjectHideFlags: 0
  m_CorrespondingSourceObject: {fileID: 0}
  m_PrefabInstance: {fileID: 0}
  m_PrefabAsset: {fileID: 0}
  m_GameObject: {fileID: 183896878367531070}
  m_LocalRotation: {x: 0, y: 0, z: 0, w: 1}
  m_LocalPosition: {x: 206.7189, y: 229.27628, z: -84.50028}
  m_LocalScale: {x: 1, y: 1, z: 1}
  m_Children: []
  m_Father: {fileID: 0}
  m_RootOrder: 0
  m_LocalEulerAnglesHint: {x: 0, y: 0, z: 0}
--- !u!114 &4024110099235763077
MonoBehaviour:
  m_ObjectHideFlags: 0
  m_CorrespondingSourceObject: {fileID: 0}
  m_PrefabInstance: {fileID: 0}
  m_PrefabAsset: {fileID: 0}
  m_GameObject: {fileID: 183896878367531070}
  m_Enabled: 1
  m_EditorHideFlags: 0
  m_Script: {fileID: 11500000, guid: 1192ef7609e540eab63eb1884b65d290, type: 3}
  m_Name: 
  m_EditorClassIdentifier: 
  _tinyAsteroidsToPool: 6
  _midAsteroidsToPool: 5
  _bigAsteroidsToPool: 4
  _bulletsToPool: 25
  _prefabs:
    player: {fileID: 243425997018467505, guid: faf458302b2ad7048a8b17ee046d6d51, type: 3}
    alien: {fileID: 6668199641362966695, guid: 629f2e4d2cc988b4587a21c6e3df30e3, type: 3}
    bulletPrefab: {fileID: 3298149136907825661, guid: 2bfd97dfd8e22f04d8ae7258dd203368, type: 3}
    asteroidsPrefabs:
    - {fileID: 4728152695526863579, guid: 0d0a7c4b4c82e104eb65d6a02744a30b, type: 3}
    - {fileID: 3121138430630327289, guid: 0299d1d506a32b64c8532b89f0ca08ec, type: 3}
    - {fileID: 153125003193431184, guid: 7b1efd445f553cc48a0dfa96588c57e3, type: 3}
    - {fileID: 7544487010248199881, guid: 3ebce0b87f97a3c4f9fdf790585989cb, type: 3}
    - {fileID: 5177357305444906153, guid: c3982c4783db8344c84b91f0a594153e, type: 3}
    - {fileID: 5605030155158574097, guid: a881841f72795004d9f25e36b8d943a3, type: 3}
    - {fileID: 4877583986870097548, guid: 87b438f8911ac964392dc823a55925a2, type: 3}
    - {fileID: 2805196200730748534, guid: 4deb6e6cff1dc19448a08275d2d43af9, type: 3}
    - {fileID: 5937790183772040231, guid: 0aa53908d943ca344afa830085d38737, type: 3}
    - {fileID: 428113853939107373, guid: 810a1f0507bdb9d458b8f1df0c93a1b5, type: 3}
    - {fileID: 3435220573970461250, guid: 15e5676bf6796a64c86fcb17a89c4650, type: 3}
    - {fileID: 254630309562924734, guid: ec3cd4a78c3d4454cae9f05ee45f971d, type: 3}
    - {fileID: 705665069180664493, guid: 64199087d5a5e844789c5f112bf79950, type: 3}
    - {fileID: 4304239442505200765, guid: 1b01d08b27067ba41b774234437e5107, type: 3}
    - {fileID: 1474950740172776107, guid: 0ff5100112e49d54d9efcc2df0b8b422, type: 3}
    boostsPrefabs:
    - {fileID: 4558901758597159574, guid: c7fd5123a1e80f54ea048aa383ed2cb9, type: 3}
    - {fileID: 3120306248989241323, guid: e24b2857dca5a5944a2dd65feedb89d3, type: 3}
    - {fileID: 7573196234965495429, guid: 75e4bca53a189a3449b62e2ed9c4d928, type: 3}
    recordString: {fileID: 3620086896256006008, guid: d6343db728003b7428eabb44f249752e, type: 3}
