%YAML 1.1
%TAG !u! tag:unity3d.com,2011:
--- !u!29 &1
OcclusionCullingSettings:
  m_ObjectHideFlags: 0
  serializedVersion: 2
  m_OcclusionBakeSettings:
    smallestOccluder: 5
    smallestHole: 0.25
    backfaceThreshold: 100
  m_SceneGUID: 00000000000000000000000000000000
  m_OcclusionCullingData: {fileID: 0}
--- !u!104 &2
RenderSettings:
  m_ObjectHideFlags: 0
  serializedVersion: 9
  m_Fog: 0
  m_FogColor: {r: 0.5, g: 0.5, b: 0.5, a: 1}
  m_FogMode: 3
  m_FogDensity: 0.01
  m_LinearFogStart: 0
  m_LinearFogEnd: 300
  m_AmbientSkyColor: {r: 0.212, g: 0.227, b: 0.259, a: 1}
  m_AmbientEquatorColor: {r: 0.114, g: 0.125, b: 0.133, a: 1}
  m_AmbientGroundColor: {r: 0.047, g: 0.043, b: 0.035, a: 1}
  m_AmbientIntensity: 1
  m_AmbientMode: 3
  m_SubtractiveShadowColor: {r: 0.42, g: 0.478, b: 0.627, a: 1}
  m_SkyboxMaterial: {fileID: 0}
  m_HaloStrength: 0.5
  m_FlareStrength: 1
  m_FlareFadeSpeed: 3
  m_HaloTexture: {fileID: 0}
  m_SpotCookie: {fileID: 10001, guid: 0000000000000000e000000000000000, type: 0}
  m_DefaultReflectionMode: 0
  m_DefaultReflectionResolution: 128
  m_ReflectionBounces: 1
  m_ReflectionIntensity: 1
  m_CustomReflection: {fileID: 0}
  m_Sun: {fileID: 0}
  m_IndirectSpecularColor: {r: 0, g: 0, b: 0, a: 1}
  m_UseRadianceAmbientProbe: 0
--- !u!157 &3
LightmapSettings:
  m_ObjectHideFlags: 0
  serializedVersion: 12
  m_GIWorkflowMode: 1
  m_GISettings:
    serializedVersion: 2
    m_BounceScale: 1
    m_IndirectOutputScale: 1
    m_AlbedoBoost: 1
    m_EnvironmentLightingMode: 0
    m_EnableBakedLightmaps: 0
    m_EnableRealtimeLightmaps: 0
  m_LightmapEditorSettings:
    serializedVersion: 12
    m_Resolution: 2
    m_BakeResolution: 40
    m_AtlasSize: 1024
    m_AO: 0
    m_AOMaxDistance: 1
    m_CompAOExponent: 1
    m_CompAOExponentDirect: 0
    m_ExtractAmbientOcclusion: 0
    m_Padding: 2
    m_LightmapParameters: {fileID: 0}
    m_LightmapsBakeMode: 1
    m_TextureCompression: 1
    m_FinalGather: 0
    m_FinalGatherFiltering: 1
    m_FinalGatherRayCount: 256
    m_ReflectionCompression: 2
    m_MixedBakeMode: 2
    m_BakeBackend: 0
    m_PVRSampling: 1
    m_PVRDirectSampleCount: 32
    m_PVRSampleCount: 500
    m_PVRBounces: 2
    m_PVREnvironmentSampleCount: 500
    m_PVREnvironmentReferencePointCount: 2048
    m_PVRFilteringMode: 2
    m_PVRDenoiserTypeDirect: 0
    m_PVRDenoiserTypeIndirect: 0
    m_PVRDenoiserTypeAO: 0
    m_PVRFilterTypeDirect: 0
    m_PVRFilterTypeIndirect: 0
    m_PVRFilterTypeAO: 0
    m_PVREnvironmentMIS: 0
    m_PVRCulling: 1
    m_PVRFilteringGaussRadiusDirect: 1
    m_PVRFilteringGaussRadiusIndirect: 5
    m_PVRFilteringGaussRadiusAO: 2
    m_PVRFilteringAtrousPositionSigmaDirect: 0.5
    m_PVRFilteringAtrousPositionSigmaIndirect: 2
    m_PVRFilteringAtrousPositionSigmaAO: 1
    m_ExportTrainingData: 0
    m_TrainingDataDestination: TrainingData
    m_LightProbeSampleCountMultiplier: 4
  m_LightingDataAsset: {fileID: 0}
  m_LightingSettings: {fileID: 0}
--- !u!196 &4
NavMeshSettings:
  serializedVersion: 2
  m_ObjectHideFlags: 0
  m_BuildSettings:
    serializedVersion: 2
    agentTypeID: 0
    agentRadius: 0.5
    agentHeight: 2
    agentSlope: 45
    agentClimb: 0.4
    ledgeDropHeight: 0
    maxJumpAcrossDistance: 0
    minRegionArea: 2
    manualCellSize: 0
    cellSize: 0.16666667
    manualTileSize: 0
    tileSize: 256
    accuratePlacement: 0
    maxJobWorkers: 0
    preserveTilesOutsideBounds: 0
    debug:
      m_Flags: 0
  m_NavMeshData: {fileID: 0}
--- !u!1 &234080098
GameObject:
  m_ObjectHideFlags: 0
  m_CorrespondingSourceObject: {fileID: 0}
  m_PrefabInstance: {fileID: 0}
  m_PrefabAsset: {fileID: 0}
  serializedVersion: 6
  m_Component:
  - component: {fileID: 234080101}
  - component: {fileID: 234080100}
  - component: {fileID: 234080099}
  m_Layer: 0
  m_Name: SpaceBackround
  m_TagString: Untagged
  m_Icon: {fileID: 0}
  m_NavMeshLayer: 0
  m_StaticEditorFlags: 0
  m_IsActive: 1
--- !u!114 &234080099
MonoBehaviour:
  m_ObjectHideFlags: 0
  m_CorrespondingSourceObject: {fileID: 0}
  m_PrefabInstance: {fileID: 0}
  m_PrefabAsset: {fileID: 0}
  m_GameObject: {fileID: 234080098}
  m_Enabled: 1
  m_EditorHideFlags: 0
  m_Script: {fileID: 11500000, guid: 5772474a96664d37b7a5d343390e785a, type: 3}
  m_Name: 
  m_EditorClassIdentifier: 
--- !u!212 &234080100
SpriteRenderer:
  m_ObjectHideFlags: 0
  m_CorrespondingSourceObject: {fileID: 0}
  m_PrefabInstance: {fileID: 0}
  m_PrefabAsset: {fileID: 0}
  m_GameObject: {fileID: 234080098}
  m_Enabled: 1
  m_CastShadows: 0
  m_ReceiveShadows: 0
  m_DynamicOccludee: 1
  m_MotionVectors: 1
  m_LightProbeUsage: 1
  m_ReflectionProbeUsage: 1
  m_RayTracingMode: 0
  m_RayTraceProcedural: 0
  m_RenderingLayerMask: 1
  m_RendererPriority: 0
  m_Materials:
  - {fileID: 10754, guid: 0000000000000000f000000000000000, type: 0}
  m_StaticBatchInfo:
    firstSubMesh: 0
    subMeshCount: 0
  m_StaticBatchRoot: {fileID: 0}
  m_ProbeAnchor: {fileID: 0}
  m_LightProbeVolumeOverride: {fileID: 0}
  m_ScaleInLightmap: 1
  m_ReceiveGI: 1
  m_PreserveUVs: 0
  m_IgnoreNormalsForChartDetection: 0
  m_ImportantGI: 0
  m_StitchLightmapSeams: 1
  m_SelectedEditorRenderState: 0
  m_MinimumChartSize: 4
  m_AutoUVMaxDistance: 0.5
  m_AutoUVMaxAngle: 89
  m_LightmapParameters: {fileID: 0}
  m_SortingLayerID: 0
  m_SortingLayer: 0
  m_SortingOrder: -1
  m_Sprite: {fileID: 21300000, guid: ce4ef9595994b4649ba0f30e7d468c0c, type: 3}
  m_Color: {r: 1, g: 1, b: 1, a: 1}
  m_FlipX: 0
  m_FlipY: 0
  m_DrawMode: 0
  m_Size: {x: 38.399998, y: 21.599998}
  m_AdaptiveModeThreshold: 0.5
  m_SpriteTileMode: 0
  m_WasSpriteAssigned: 1
  m_MaskInteraction: 0
  m_SpriteSortPoint: 0
--- !u!4 &234080101
Transform:
  m_ObjectHideFlags: 0
  m_CorrespondingSourceObject: {fileID: 0}
  m_PrefabInstance: {fileID: 0}
  m_PrefabAsset: {fileID: 0}
  m_GameObject: {fileID: 234080098}
  m_LocalRotation: {x: 0, y: 0, z: 0, w: 1}
  m_LocalPosition: {x: -3.1, y: -26.4, z: 0}
  m_LocalScale: {x: 1, y: 1, z: 1}
  m_Children: []
  m_Father: {fileID: 0}
  m_RootOrder: 1
  m_LocalEulerAnglesHint: {x: 0, y: 0, z: 0}
--- !u!1001 &345259131
PrefabInstance:
  m_ObjectHideFlags: 0
  serializedVersion: 2
  m_Modification:
    m_TransformParent: {fileID: 0}
    m_Modifications:
    - target: {fileID: 2240250034627573905, guid: 042db41f5898fbc4d98303e0116a7684, type: 3}
      propertyPath: m_Name
      value: SaveManager
      objectReference: {fileID: 0}
    - target: {fileID: 2240250034627573907, guid: 042db41f5898fbc4d98303e0116a7684, type: 3}
      propertyPath: m_RootOrder
      value: 6
      objectReference: {fileID: 0}
    - target: {fileID: 2240250034627573907, guid: 042db41f5898fbc4d98303e0116a7684, type: 3}
      propertyPath: m_LocalPosition.x
      value: 125.0663
      objectReference: {fileID: 0}
    - target: {fileID: 2240250034627573907, guid: 042db41f5898fbc4d98303e0116a7684, type: 3}
      propertyPath: m_LocalPosition.y
      value: 273.06024
      objectReference: {fileID: 0}
    - target: {fileID: 2240250034627573907, guid: 042db41f5898fbc4d98303e0116a7684, type: 3}
      propertyPath: m_LocalPosition.z
      value: -825.2842
      objectReference: {fileID: 0}
    - target: {fileID: 2240250034627573907, guid: 042db41f5898fbc4d98303e0116a7684, type: 3}
      propertyPath: m_LocalRotation.w
      value: 1
      objectReference: {fileID: 0}
    - target: {fileID: 2240250034627573907, guid: 042db41f5898fbc4d98303e0116a7684, type: 3}
      propertyPath: m_LocalRotation.x
      value: 0
      objectReference: {fileID: 0}
    - target: {fileID: 2240250034627573907, guid: 042db41f5898fbc4d98303e0116a7684, type: 3}
      propertyPath: m_LocalRotation.y
      value: 0
      objectReference: {fileID: 0}
    - target: {fileID: 2240250034627573907, guid: 042db41f5898fbc4d98303e0116a7684, type: 3}
      propertyPath: m_LocalRotation.z
      value: 0
      objectReference: {fileID: 0}
    - target: {fileID: 2240250034627573907, guid: 042db41f5898fbc4d98303e0116a7684, type: 3}
      propertyPath: m_LocalEulerAnglesHint.x
      value: 0
      objectReference: {fileID: 0}
    - target: {fileID: 2240250034627573907, guid: 042db41f5898fbc4d98303e0116a7684, type: 3}
      propertyPath: m_LocalEulerAnglesHint.y
      value: 0
      objectReference: {fileID: 0}
    - target: {fileID: 2240250034627573907, guid: 042db41f5898fbc4d98303e0116a7684, type: 3}
      propertyPath: m_LocalEulerAnglesHint.z
      value: 0
      objectReference: {fileID: 0}
    m_RemovedComponents: []
  m_SourcePrefab: {fileID: 100100000, guid: 042db41f5898fbc4d98303e0116a7684, type: 3}
--- !u!1001 &352276157
PrefabInstance:
  m_ObjectHideFlags: 0
  serializedVersion: 2
  m_Modification:
    m_TransformParent: {fileID: 855955691}
    m_Modifications:
    - target: {fileID: 8116669684554607660, guid: 9656e97b324d14b4ebffdae1e1f34e8e, type: 3}
      propertyPath: m_Pivot.x
      value: 0.5
      objectReference: {fileID: 0}
    - target: {fileID: 8116669684554607660, guid: 9656e97b324d14b4ebffdae1e1f34e8e, type: 3}
      propertyPath: m_Pivot.y
      value: 0.5
      objectReference: {fileID: 0}
    - target: {fileID: 8116669684554607660, guid: 9656e97b324d14b4ebffdae1e1f34e8e, type: 3}
      propertyPath: m_RootOrder
      value: 5
      objectReference: {fileID: 0}
    - target: {fileID: 8116669684554607660, guid: 9656e97b324d14b4ebffdae1e1f34e8e, type: 3}
      propertyPath: m_AnchorMax.x
      value: 1
      objectReference: {fileID: 0}
    - target: {fileID: 8116669684554607660, guid: 9656e97b324d14b4ebffdae1e1f34e8e, type: 3}
      propertyPath: m_AnchorMax.y
      value: 1
      objectReference: {fileID: 0}
    - target: {fileID: 8116669684554607660, guid: 9656e97b324d14b4ebffdae1e1f34e8e, type: 3}
      propertyPath: m_AnchorMin.x
      value: 0
      objectReference: {fileID: 0}
    - target: {fileID: 8116669684554607660, guid: 9656e97b324d14b4ebffdae1e1f34e8e, type: 3}
      propertyPath: m_AnchorMin.y
      value: 0
      objectReference: {fileID: 0}
    - target: {fileID: 8116669684554607660, guid: 9656e97b324d14b4ebffdae1e1f34e8e, type: 3}
      propertyPath: m_SizeDelta.x
      value: -720
      objectReference: {fileID: 0}
    - target: {fileID: 8116669684554607660, guid: 9656e97b324d14b4ebffdae1e1f34e8e, type: 3}
      propertyPath: m_SizeDelta.y
      value: -102.932526
      objectReference: {fileID: 0}
    - target: {fileID: 8116669684554607660, guid: 9656e97b324d14b4ebffdae1e1f34e8e, type: 3}
      propertyPath: m_LocalPosition.x
      value: 0
      objectReference: {fileID: 0}
    - target: {fileID: 8116669684554607660, guid: 9656e97b324d14b4ebffdae1e1f34e8e, type: 3}
      propertyPath: m_LocalPosition.y
      value: 0
      objectReference: {fileID: 0}
    - target: {fileID: 8116669684554607660, guid: 9656e97b324d14b4ebffdae1e1f34e8e, type: 3}
      propertyPath: m_LocalPosition.z
      value: 0
      objectReference: {fileID: 0}
    - target: {fileID: 8116669684554607660, guid: 9656e97b324d14b4ebffdae1e1f34e8e, type: 3}
      propertyPath: m_LocalRotation.w
      value: 1
      objectReference: {fileID: 0}
    - target: {fileID: 8116669684554607660, guid: 9656e97b324d14b4ebffdae1e1f34e8e, type: 3}
      propertyPath: m_LocalRotation.x
      value: 0
      objectReference: {fileID: 0}
    - target: {fileID: 8116669684554607660, guid: 9656e97b324d14b4ebffdae1e1f34e8e, type: 3}
      propertyPath: m_LocalRotation.y
      value: 0
      objectReference: {fileID: 0}
    - target: {fileID: 8116669684554607660, guid: 9656e97b324d14b4ebffdae1e1f34e8e, type: 3}
      propertyPath: m_LocalRotation.z
      value: 0
      objectReference: {fileID: 0}
    - target: {fileID: 8116669684554607660, guid: 9656e97b324d14b4ebffdae1e1f34e8e, type: 3}
      propertyPath: m_AnchoredPosition.x
      value: 0
      objectReference: {fileID: 0}
    - target: {fileID: 8116669684554607660, guid: 9656e97b324d14b4ebffdae1e1f34e8e, type: 3}
      propertyPath: m_AnchoredPosition.y
      value: 0
      objectReference: {fileID: 0}
    - target: {fileID: 8116669684554607660, guid: 9656e97b324d14b4ebffdae1e1f34e8e, type: 3}
      propertyPath: m_LocalEulerAnglesHint.x
      value: 0
      objectReference: {fileID: 0}
    - target: {fileID: 8116669684554607660, guid: 9656e97b324d14b4ebffdae1e1f34e8e, type: 3}
      propertyPath: m_LocalEulerAnglesHint.y
      value: 0
      objectReference: {fileID: 0}
    - target: {fileID: 8116669684554607660, guid: 9656e97b324d14b4ebffdae1e1f34e8e, type: 3}
      propertyPath: m_LocalEulerAnglesHint.z
      value: 0
      objectReference: {fileID: 0}
    - target: {fileID: 8116669684554607661, guid: 9656e97b324d14b4ebffdae1e1f34e8e, type: 3}
      propertyPath: m_Name
      value: SettingsScreen
      objectReference: {fileID: 0}
    m_RemovedComponents: []
  m_SourcePrefab: {fileID: 100100000, guid: 9656e97b324d14b4ebffdae1e1f34e8e, type: 3}
--- !u!1 &519420028
GameObject:
  m_ObjectHideFlags: 0
  m_CorrespondingSourceObject: {fileID: 0}
  m_PrefabInstance: {fileID: 0}
  m_PrefabAsset: {fileID: 0}
  serializedVersion: 6
  m_Component:
  - component: {fileID: 519420032}
  - component: {fileID: 519420031}
  - component: {fileID: 519420029}
  m_Layer: 0
  m_Name: Main Camera
  m_TagString: MainCamera
  m_Icon: {fileID: 0}
  m_NavMeshLayer: 0
  m_StaticEditorFlags: 0
  m_IsActive: 1
--- !u!81 &519420029
AudioListener:
  m_ObjectHideFlags: 0
  m_CorrespondingSourceObject: {fileID: 0}
  m_PrefabInstance: {fileID: 0}
  m_PrefabAsset: {fileID: 0}
  m_GameObject: {fileID: 519420028}
  m_Enabled: 1
--- !u!20 &519420031
Camera:
  m_ObjectHideFlags: 0
  m_CorrespondingSourceObject: {fileID: 0}
  m_PrefabInstance: {fileID: 0}
  m_PrefabAsset: {fileID: 0}
  m_GameObject: {fileID: 519420028}
  m_Enabled: 1
  serializedVersion: 2
  m_ClearFlags: 2
  m_BackGroundColor: {r: 0, g: 0, b: 0, a: 1}
  m_projectionMatrixMode: 1
  m_GateFitMode: 2
  m_FOVAxisMode: 0
  m_SensorSize: {x: 36, y: 24}
  m_LensShift: {x: 0, y: 0}
  m_FocalLength: 50
  m_NormalizedViewPortRect:
    serializedVersion: 2
    x: 0
    y: 0
    width: 1
    height: 1
  near clip plane: 0.3
  far clip plane: 1000
  field of view: 60
  orthographic: 1
  orthographic size: 4
  m_Depth: 0
  m_CullingMask:
    serializedVersion: 2
    m_Bits: 4294967295
  m_RenderingPath: -1
  m_TargetTexture: {fileID: 0}
  m_TargetDisplay: 0
  m_TargetEye: 0
  m_HDR: 1
  m_AllowMSAA: 0
  m_AllowDynamicResolution: 0
  m_ForceIntoRT: 0
  m_OcclusionCulling: 0
  m_StereoConvergence: 10
  m_StereoSeparation: 0.022
--- !u!4 &519420032
Transform:
  m_ObjectHideFlags: 0
  m_CorrespondingSourceObject: {fileID: 0}
  m_PrefabInstance: {fileID: 0}
  m_PrefabAsset: {fileID: 0}
  m_GameObject: {fileID: 519420028}
  m_LocalRotation: {x: 0, y: 0, z: 0, w: 1}
  m_LocalPosition: {x: 0, y: 0, z: -10}
  m_LocalScale: {x: 1, y: 1, z: 1}
  m_Children: []
  m_Father: {fileID: 0}
  m_RootOrder: 0
  m_LocalEulerAnglesHint: {x: 0, y: 0, z: 0}
--- !u!1001 &786270577
PrefabInstance:
  m_ObjectHideFlags: 0
  serializedVersion: 2
  m_Modification:
    m_TransformParent: {fileID: 855955691}
    m_Modifications:
    - target: {fileID: 3537977490886265880, guid: 3560442e3e441e247a2432997733409a, type: 3}
      propertyPath: m_Pivot.x
      value: 0.5
      objectReference: {fileID: 0}
    - target: {fileID: 3537977490886265880, guid: 3560442e3e441e247a2432997733409a, type: 3}
      propertyPath: m_Pivot.y
      value: 0.5
      objectReference: {fileID: 0}
    - target: {fileID: 3537977490886265880, guid: 3560442e3e441e247a2432997733409a, type: 3}
      propertyPath: m_RootOrder
      value: 6
      objectReference: {fileID: 0}
    - target: {fileID: 3537977490886265880, guid: 3560442e3e441e247a2432997733409a, type: 3}
      propertyPath: m_AnchorMax.x
      value: 1
      objectReference: {fileID: 0}
    - target: {fileID: 3537977490886265880, guid: 3560442e3e441e247a2432997733409a, type: 3}
      propertyPath: m_AnchorMax.y
      value: 1
      objectReference: {fileID: 0}
    - target: {fileID: 3537977490886265880, guid: 3560442e3e441e247a2432997733409a, type: 3}
      propertyPath: m_AnchorMin.x
      value: 0
      objectReference: {fileID: 0}
    - target: {fileID: 3537977490886265880, guid: 3560442e3e441e247a2432997733409a, type: 3}
      propertyPath: m_AnchorMin.y
      value: 0
      objectReference: {fileID: 0}
    - target: {fileID: 3537977490886265880, guid: 3560442e3e441e247a2432997733409a, type: 3}
      propertyPath: m_SizeDelta.x
      value: -720
      objectReference: {fileID: 0}
    - target: {fileID: 3537977490886265880, guid: 3560442e3e441e247a2432997733409a, type: 3}
      propertyPath: m_SizeDelta.y
      value: -102.9325
      objectReference: {fileID: 0}
    - target: {fileID: 3537977490886265880, guid: 3560442e3e441e247a2432997733409a, type: 3}
      propertyPath: m_LocalPosition.x
      value: 0
      objectReference: {fileID: 0}
    - target: {fileID: 3537977490886265880, guid: 3560442e3e441e247a2432997733409a, type: 3}
      propertyPath: m_LocalPosition.y
      value: 0
      objectReference: {fileID: 0}
    - target: {fileID: 3537977490886265880, guid: 3560442e3e441e247a2432997733409a, type: 3}
      propertyPath: m_LocalPosition.z
      value: 0
      objectReference: {fileID: 0}
    - target: {fileID: 3537977490886265880, guid: 3560442e3e441e247a2432997733409a, type: 3}
      propertyPath: m_LocalRotation.w
      value: 1
      objectReference: {fileID: 0}
    - target: {fileID: 3537977490886265880, guid: 3560442e3e441e247a2432997733409a, type: 3}
      propertyPath: m_LocalRotation.x
      value: 0
      objectReference: {fileID: 0}
    - target: {fileID: 3537977490886265880, guid: 3560442e3e441e247a2432997733409a, type: 3}
      propertyPath: m_LocalRotation.y
      value: 0
      objectReference: {fileID: 0}
    - target: {fileID: 3537977490886265880, guid: 3560442e3e441e247a2432997733409a, type: 3}
      propertyPath: m_LocalRotation.z
      value: 0
      objectReference: {fileID: 0}
    - target: {fileID: 3537977490886265880, guid: 3560442e3e441e247a2432997733409a, type: 3}
      propertyPath: m_AnchoredPosition.x
      value: 0
      objectReference: {fileID: 0}
    - target: {fileID: 3537977490886265880, guid: 3560442e3e441e247a2432997733409a, type: 3}
      propertyPath: m_AnchoredPosition.y
      value: 0
      objectReference: {fileID: 0}
    - target: {fileID: 3537977490886265880, guid: 3560442e3e441e247a2432997733409a, type: 3}
      propertyPath: m_LocalEulerAnglesHint.x
      value: 0
      objectReference: {fileID: 0}
    - target: {fileID: 3537977490886265880, guid: 3560442e3e441e247a2432997733409a, type: 3}
      propertyPath: m_LocalEulerAnglesHint.y
      value: 0
      objectReference: {fileID: 0}
    - target: {fileID: 3537977490886265880, guid: 3560442e3e441e247a2432997733409a, type: 3}
      propertyPath: m_LocalEulerAnglesHint.z
      value: 0
      objectReference: {fileID: 0}
    - target: {fileID: 3537977490886265881, guid: 3560442e3e441e247a2432997733409a, type: 3}
      propertyPath: m_Name
      value: LeaderboardScreen
      objectReference: {fileID: 0}
    m_RemovedComponents: []
  m_SourcePrefab: {fileID: 100100000, guid: 3560442e3e441e247a2432997733409a, type: 3}
--- !u!1001 &795489626
PrefabInstance:
  m_ObjectHideFlags: 0
  serializedVersion: 2
  m_Modification:
    m_TransformParent: {fileID: 0}
    m_Modifications:
    - target: {fileID: 979282965326073608, guid: 3ba5f8f7e843e3f4db34e3044ffad8d8, type: 3}
      propertyPath: m_RootOrder
      value: 2
      objectReference: {fileID: 0}
    - target: {fileID: 979282965326073608, guid: 3ba5f8f7e843e3f4db34e3044ffad8d8, type: 3}
      propertyPath: m_LocalPosition.x
      value: 3.2845566
      objectReference: {fileID: 0}
    - target: {fileID: 979282965326073608, guid: 3ba5f8f7e843e3f4db34e3044ffad8d8, type: 3}
      propertyPath: m_LocalPosition.y
      value: -6.637045
      objectReference: {fileID: 0}
    - target: {fileID: 979282965326073608, guid: 3ba5f8f7e843e3f4db34e3044ffad8d8, type: 3}
      propertyPath: m_LocalPosition.z
      value: -16.514505
      objectReference: {fileID: 0}
    - target: {fileID: 979282965326073608, guid: 3ba5f8f7e843e3f4db34e3044ffad8d8, type: 3}
      propertyPath: m_LocalRotation.w
      value: 1
      objectReference: {fileID: 0}
    - target: {fileID: 979282965326073608, guid: 3ba5f8f7e843e3f4db34e3044ffad8d8, type: 3}
      propertyPath: m_LocalRotation.x
      value: 0
      objectReference: {fileID: 0}
    - target: {fileID: 979282965326073608, guid: 3ba5f8f7e843e3f4db34e3044ffad8d8, type: 3}
      propertyPath: m_LocalRotation.y
      value: 0
      objectReference: {fileID: 0}
    - target: {fileID: 979282965326073608, guid: 3ba5f8f7e843e3f4db34e3044ffad8d8, type: 3}
      propertyPath: m_LocalRotation.z
      value: 0
      objectReference: {fileID: 0}
    - target: {fileID: 979282965326073608, guid: 3ba5f8f7e843e3f4db34e3044ffad8d8, type: 3}
      propertyPath: m_LocalEulerAnglesHint.x
      value: 0
      objectReference: {fileID: 0}
    - target: {fileID: 979282965326073608, guid: 3ba5f8f7e843e3f4db34e3044ffad8d8, type: 3}
      propertyPath: m_LocalEulerAnglesHint.y
      value: 0
      objectReference: {fileID: 0}
    - target: {fileID: 979282965326073608, guid: 3ba5f8f7e843e3f4db34e3044ffad8d8, type: 3}
      propertyPath: m_LocalEulerAnglesHint.z
      value: 0
      objectReference: {fileID: 0}
    - target: {fileID: 979282965326073655, guid: 3ba5f8f7e843e3f4db34e3044ffad8d8, type: 3}
      propertyPath: m_Name
      value: GameArea
      objectReference: {fileID: 0}
    m_RemovedComponents: []
  m_SourcePrefab: {fileID: 100100000, guid: 3ba5f8f7e843e3f4db34e3044ffad8d8, type: 3}
--- !u!1 &855955687
GameObject:
  m_ObjectHideFlags: 0
  m_CorrespondingSourceObject: {fileID: 0}
  m_PrefabInstance: {fileID: 0}
  m_PrefabAsset: {fileID: 0}
  serializedVersion: 6
  m_Component:
  - component: {fileID: 855955691}
  - component: {fileID: 855955690}
  - component: {fileID: 855955689}
  - component: {fileID: 855955688}
  - component: {fileID: 855955693}
  - component: {fileID: 855955692}
  m_Layer: 5
  m_Name: Canvas
  m_TagString: Untagged
  m_Icon: {fileID: 0}
  m_NavMeshLayer: 0
  m_StaticEditorFlags: 0
  m_IsActive: 1
--- !u!114 &855955688
MonoBehaviour:
  m_ObjectHideFlags: 0
  m_CorrespondingSourceObject: {fileID: 0}
  m_PrefabInstance: {fileID: 0}
  m_PrefabAsset: {fileID: 0}
  m_GameObject: {fileID: 855955687}
  m_Enabled: 1
  m_EditorHideFlags: 0
  m_Script: {fileID: 11500000, guid: dc42784cf147c0c48a680349fa168899, type: 3}
  m_Name: 
  m_EditorClassIdentifier: 
  m_IgnoreReversedGraphics: 1
  m_BlockingObjects: 0
  m_BlockingMask:
    serializedVersion: 2
    m_Bits: 4294967295
--- !u!114 &855955689
MonoBehaviour:
  m_ObjectHideFlags: 0
  m_CorrespondingSourceObject: {fileID: 0}
  m_PrefabInstance: {fileID: 0}
  m_PrefabAsset: {fileID: 0}
  m_GameObject: {fileID: 855955687}
  m_Enabled: 1
  m_EditorHideFlags: 0
  m_Script: {fileID: 11500000, guid: 0cd44c1031e13a943bb63640046fad76, type: 3}
  m_Name: 
  m_EditorClassIdentifier: 
  m_UiScaleMode: 1
  m_ReferencePixelsPerUnit: 100
  m_ScaleFactor: 1
  m_ReferenceResolution: {x: 1920, y: 1080}
  m_ScreenMatchMode: 0
  m_MatchWidthOrHeight: 0
  m_PhysicalUnit: 3
  m_FallbackScreenDPI: 96
  m_DefaultSpriteDPI: 96
  m_DynamicPixelsPerUnit: 1
  m_PresetInfoIsWorld: 0
--- !u!223 &855955690
Canvas:
  m_ObjectHideFlags: 0
  m_CorrespondingSourceObject: {fileID: 0}
  m_PrefabInstance: {fileID: 0}
  m_PrefabAsset: {fileID: 0}
  m_GameObject: {fileID: 855955687}
  m_Enabled: 1
  serializedVersion: 3
  m_RenderMode: 0
  m_Camera: {fileID: 0}
  m_PlaneDistance: 100
  m_PixelPerfect: 0
  m_ReceivesEvents: 1
  m_OverrideSorting: 0
  m_OverridePixelPerfect: 0
  m_SortingBucketNormalizedSize: 0
  m_AdditionalShaderChannelsFlag: 0
  m_SortingLayerID: 0
  m_SortingOrder: 0
  m_TargetDisplay: 0
--- !u!224 &855955691
RectTransform:
  m_ObjectHideFlags: 0
  m_CorrespondingSourceObject: {fileID: 0}
  m_PrefabInstance: {fileID: 0}
  m_PrefabAsset: {fileID: 0}
  m_GameObject: {fileID: 855955687}
  m_LocalRotation: {x: 0, y: 0, z: 0, w: 1}
  m_LocalPosition: {x: 0, y: 0, z: 0}
  m_LocalScale: {x: 0, y: 0, z: 0}
  m_Children:
  - {fileID: 1359804415}
  - {fileID: 1001782989}
  - {fileID: 950518407}
  - {fileID: 1089247956}
  - {fileID: 3488847035152732355}
  - {fileID: 1010885867}
  - {fileID: 1110261506}
  m_Father: {fileID: 0}
  m_RootOrder: 11
  m_LocalEulerAnglesHint: {x: 0, y: 0, z: 0}
  m_AnchorMin: {x: 0, y: 0}
  m_AnchorMax: {x: 0, y: 0}
  m_AnchoredPosition: {x: 0, y: 0}
  m_SizeDelta: {x: 0, y: 0}
  m_Pivot: {x: 0, y: 0}
--- !u!114 &855955692
MonoBehaviour:
  m_ObjectHideFlags: 0
  m_CorrespondingSourceObject: {fileID: 0}
  m_PrefabInstance: {fileID: 0}
  m_PrefabAsset: {fileID: 0}
  m_GameObject: {fileID: 855955687}
  m_Enabled: 1
  m_EditorHideFlags: 0
  m_Script: {fileID: 11500000, guid: 01614664b831546d2ae94a42149d80ac, type: 3}
  m_Name: 
  m_EditorClassIdentifier: 
  m_MoveRepeatDelay: 0.5
  m_MoveRepeatRate: 0.1
  m_ActionsAsset: {fileID: -944628639613478452, guid: 05dc6ca1b82bfc8488f159f75e6b2c02, type: 3}
  m_PointAction: {fileID: 7336497183322434074, guid: 05dc6ca1b82bfc8488f159f75e6b2c02, type: 3}
  m_MoveAction: {fileID: -1826418260587586470, guid: 05dc6ca1b82bfc8488f159f75e6b2c02, type: 3}
  m_SubmitAction: {fileID: 5975189525314119682, guid: 05dc6ca1b82bfc8488f159f75e6b2c02, type: 3}
  m_CancelAction: {fileID: 4347663366824578814, guid: 05dc6ca1b82bfc8488f159f75e6b2c02, type: 3}
  m_LeftClickAction: {fileID: 8779771875689538401, guid: 05dc6ca1b82bfc8488f159f75e6b2c02, type: 3}
  m_MiddleClickAction: {fileID: -7284897255701063964, guid: 05dc6ca1b82bfc8488f159f75e6b2c02, type: 3}
  m_RightClickAction: {fileID: -7620498748572976595, guid: 05dc6ca1b82bfc8488f159f75e6b2c02, type: 3}
  m_ScrollWheelAction: {fileID: 6939032723320409745, guid: 05dc6ca1b82bfc8488f159f75e6b2c02, type: 3}
  m_TrackedDevicePositionAction: {fileID: -4773126687272154433, guid: 05dc6ca1b82bfc8488f159f75e6b2c02, type: 3}
  m_TrackedDeviceOrientationAction: {fileID: -3212883756656359484, guid: 05dc6ca1b82bfc8488f159f75e6b2c02, type: 3}
  m_DeselectOnBackgroundClick: 1
  m_PointerBehavior: 0
--- !u!114 &855955693
MonoBehaviour:
  m_ObjectHideFlags: 0
  m_CorrespondingSourceObject: {fileID: 0}
  m_PrefabInstance: {fileID: 0}
  m_PrefabAsset: {fileID: 0}
  m_GameObject: {fileID: 855955687}
  m_Enabled: 1
  m_EditorHideFlags: 0
  m_Script: {fileID: 11500000, guid: 76c392e42b5098c458856cdf6ecaaaa1, type: 3}
  m_Name: 
  m_EditorClassIdentifier: 
  m_FirstSelected: {fileID: 0}
  m_sendNavigationEvents: 1
  m_DragThreshold: 10
--- !u!224 &950518407 stripped
RectTransform:
  m_CorrespondingSourceObject: {fileID: 7365519152782231152, guid: 2b4866d073ad732498fa34b2872b5f26, type: 3}
  m_PrefabInstance: {fileID: 7745349689704760459}
  m_PrefabAsset: {fileID: 0}
--- !u!114 &950518408 stripped
MonoBehaviour:
  m_CorrespondingSourceObject: {fileID: 1721322223873044972, guid: 2b4866d073ad732498fa34b2872b5f26, type: 3}
  m_PrefabInstance: {fileID: 7745349689704760459}
  m_PrefabAsset: {fileID: 0}
  m_GameObject: {fileID: 0}
  m_Enabled: 1
  m_EditorHideFlags: 0
  m_Script: {fileID: 11500000, guid: f4f42867d85e464f8ac12c43e5f7d709, type: 3}
  m_Name: 
  m_EditorClassIdentifier: 
--- !u!224 &1001782989 stripped
RectTransform:
  m_CorrespondingSourceObject: {fileID: 4825622020594853168, guid: 2ff3ead1820d7884ea37923c00eb475f, type: 3}
  m_PrefabInstance: {fileID: 1826367369}
  m_PrefabAsset: {fileID: 0}
--- !u!114 &1001782991 stripped
MonoBehaviour:
  m_CorrespondingSourceObject: {fileID: 2631464674570028264, guid: 2ff3ead1820d7884ea37923c00eb475f, type: 3}
  m_PrefabInstance: {fileID: 1826367369}
  m_PrefabAsset: {fileID: 0}
  m_GameObject: {fileID: 0}
  m_Enabled: 1
  m_EditorHideFlags: 0
  m_Script: {fileID: 11500000, guid: 15eae3b5576246f0adb07c82f39f78de, type: 3}
  m_Name: 
  m_EditorClassIdentifier: 
--- !u!224 &1010885867 stripped
RectTransform:
  m_CorrespondingSourceObject: {fileID: 8116669684554607660, guid: 9656e97b324d14b4ebffdae1e1f34e8e, type: 3}
  m_PrefabInstance: {fileID: 352276157}
  m_PrefabAsset: {fileID: 0}
--- !u!114 &1010885870 stripped
MonoBehaviour:
  m_CorrespondingSourceObject: {fileID: 8116669684554607657, guid: 9656e97b324d14b4ebffdae1e1f34e8e, type: 3}
  m_PrefabInstance: {fileID: 352276157}
  m_PrefabAsset: {fileID: 0}
  m_GameObject: {fileID: 0}
  m_Enabled: 1
  m_EditorHideFlags: 0
  m_Script: {fileID: 11500000, guid: cf94044758bc4d8b96730df8f7fae068, type: 3}
  m_Name: 
  m_EditorClassIdentifier: 
--- !u!224 &1089247956 stripped
RectTransform:
  m_CorrespondingSourceObject: {fileID: 157309845878643905, guid: e06b36cd012c4539ac48c7186ef2c1da, type: 3}
  m_PrefabInstance: {fileID: 6908300207862379922}
  m_PrefabAsset: {fileID: 0}
--- !u!114 &1089247957 stripped
MonoBehaviour:
  m_CorrespondingSourceObject: {fileID: 157309845878643908, guid: e06b36cd012c4539ac48c7186ef2c1da, type: 3}
  m_PrefabInstance: {fileID: 6908300207862379922}
  m_PrefabAsset: {fileID: 0}
  m_GameObject: {fileID: 0}
  m_Enabled: 1
  m_EditorHideFlags: 0
  m_Script: {fileID: 11500000, guid: 80633c764c1f4757964b88075256bbab, type: 3}
  m_Name: 
  m_EditorClassIdentifier: 
--- !u!224 &1110261506 stripped
RectTransform:
  m_CorrespondingSourceObject: {fileID: 3537977490886265880, guid: 3560442e3e441e247a2432997733409a, type: 3}
  m_PrefabInstance: {fileID: 786270577}
  m_PrefabAsset: {fileID: 0}
--- !u!114 &1110261507 stripped
MonoBehaviour:
  m_CorrespondingSourceObject: {fileID: 3537977490886265957, guid: 3560442e3e441e247a2432997733409a, type: 3}
  m_PrefabInstance: {fileID: 786270577}
  m_PrefabAsset: {fileID: 0}
  m_GameObject: {fileID: 0}
  m_Enabled: 1
  m_EditorHideFlags: 0
  m_Script: {fileID: 11500000, guid: 8f309cebdf9d48039c1b0f9cf5a08bf2, type: 3}
  m_Name: 
  m_EditorClassIdentifier: 
--- !u!1001 &1124069448
PrefabInstance:
  m_ObjectHideFlags: 0
  serializedVersion: 2
  m_Modification:
    m_TransformParent: {fileID: 0}
    m_Modifications:
    - target: {fileID: 183896878367531070, guid: f68f124b997502541bab07fe063ddbc0, type: 3}
      propertyPath: m_Name
      value: SpawnManager
      objectReference: {fileID: 0}
    - target: {fileID: 4024110099235763077, guid: f68f124b997502541bab07fe063ddbc0, type: 3}
      propertyPath: _prefabs.player
      value: 
      objectReference: {fileID: 3749803965330596127, guid: 46af078e2da24e7493568087fe236219, type: 3}
    - target: {fileID: 4024110099235763077, guid: f68f124b997502541bab07fe063ddbc0, type: 3}
      propertyPath: _prefabs.soundPrefab
      value: 
      objectReference: {fileID: 8924012291676846318, guid: c88962507744fed4f9afed72c7a1b0e9, type: 3}
    - target: {fileID: 4024110099235763077, guid: f68f124b997502541bab07fe063ddbc0, type: 3}
      propertyPath: _prefabs.shopItemView
      value: 
      objectReference: {fileID: 2621093714369234094, guid: d4550e833f1a428581fa8e0f8efaef41, type: 3}
    - target: {fileID: 5447525347037022395, guid: f68f124b997502541bab07fe063ddbc0, type: 3}
      propertyPath: m_RootOrder
      value: 3
      objectReference: {fileID: 0}
    - target: {fileID: 5447525347037022395, guid: f68f124b997502541bab07fe063ddbc0, type: 3}
      propertyPath: m_LocalPosition.x
      value: 9.814184
      objectReference: {fileID: 0}
    - target: {fileID: 5447525347037022395, guid: f68f124b997502541bab07fe063ddbc0, type: 3}
      propertyPath: m_LocalPosition.y
      value: 0.5901747
      objectReference: {fileID: 0}
    - target: {fileID: 5447525347037022395, guid: f68f124b997502541bab07fe063ddbc0, type: 3}
      propertyPath: m_LocalPosition.z
      value: -84.50028
      objectReference: {fileID: 0}
    - target: {fileID: 5447525347037022395, guid: f68f124b997502541bab07fe063ddbc0, type: 3}
      propertyPath: m_LocalRotation.w
      value: 1
      objectReference: {fileID: 0}
    - target: {fileID: 5447525347037022395, guid: f68f124b997502541bab07fe063ddbc0, type: 3}
      propertyPath: m_LocalRotation.x
      value: -0
      objectReference: {fileID: 0}
    - target: {fileID: 5447525347037022395, guid: f68f124b997502541bab07fe063ddbc0, type: 3}
      propertyPath: m_LocalRotation.y
      value: -0
      objectReference: {fileID: 0}
    - target: {fileID: 5447525347037022395, guid: f68f124b997502541bab07fe063ddbc0, type: 3}
      propertyPath: m_LocalRotation.z
      value: -0
      objectReference: {fileID: 0}
    - target: {fileID: 5447525347037022395, guid: f68f124b997502541bab07fe063ddbc0, type: 3}
      propertyPath: m_LocalEulerAnglesHint.x
      value: 0
      objectReference: {fileID: 0}
    - target: {fileID: 5447525347037022395, guid: f68f124b997502541bab07fe063ddbc0, type: 3}
      propertyPath: m_LocalEulerAnglesHint.y
      value: 0
      objectReference: {fileID: 0}
    - target: {fileID: 5447525347037022395, guid: f68f124b997502541bab07fe063ddbc0, type: 3}
      propertyPath: m_LocalEulerAnglesHint.z
      value: 0
      objectReference: {fileID: 0}
    m_RemovedComponents: []
  m_SourcePrefab: {fileID: 100100000, guid: f68f124b997502541bab07fe063ddbc0, type: 3}
--- !u!1001 &1234023281
PrefabInstance:
  m_ObjectHideFlags: 0
  serializedVersion: 2
  m_Modification:
    m_TransformParent: {fileID: 855955691}
    m_Modifications:
    - target: {fileID: 218852605449744292, guid: f9d7393e697e9644291f49eab437e7e5, type: 3}
      propertyPath: m_Name
      value: MainMenuScreen
      objectReference: {fileID: 0}
    - target: {fileID: 218852605449744292, guid: f9d7393e697e9644291f49eab437e7e5, type: 3}
      propertyPath: m_IsActive
      value: 1
      objectReference: {fileID: 0}
    - target: {fileID: 2063248440274381664, guid: f9d7393e697e9644291f49eab437e7e5, type: 3}
      propertyPath: m_Pivot.x
      value: 0.5
      objectReference: {fileID: 0}
    - target: {fileID: 2063248440274381664, guid: f9d7393e697e9644291f49eab437e7e5, type: 3}
      propertyPath: m_Pivot.y
      value: 0.5
      objectReference: {fileID: 0}
    - target: {fileID: 2063248440274381664, guid: f9d7393e697e9644291f49eab437e7e5, type: 3}
      propertyPath: m_RootOrder
      value: 0
      objectReference: {fileID: 0}
    - target: {fileID: 2063248440274381664, guid: f9d7393e697e9644291f49eab437e7e5, type: 3}
      propertyPath: m_AnchorMax.x
      value: 1
      objectReference: {fileID: 0}
    - target: {fileID: 2063248440274381664, guid: f9d7393e697e9644291f49eab437e7e5, type: 3}
      propertyPath: m_AnchorMax.y
      value: 1
      objectReference: {fileID: 0}
    - target: {fileID: 2063248440274381664, guid: f9d7393e697e9644291f49eab437e7e5, type: 3}
      propertyPath: m_AnchorMin.x
      value: 0
      objectReference: {fileID: 0}
    - target: {fileID: 2063248440274381664, guid: f9d7393e697e9644291f49eab437e7e5, type: 3}
      propertyPath: m_AnchorMin.y
      value: 0
      objectReference: {fileID: 0}
    - target: {fileID: 2063248440274381664, guid: f9d7393e697e9644291f49eab437e7e5, type: 3}
      propertyPath: m_SizeDelta.x
      value: 0
      objectReference: {fileID: 0}
    - target: {fileID: 2063248440274381664, guid: f9d7393e697e9644291f49eab437e7e5, type: 3}
      propertyPath: m_SizeDelta.y
      value: 0
      objectReference: {fileID: 0}
    - target: {fileID: 2063248440274381664, guid: f9d7393e697e9644291f49eab437e7e5, type: 3}
      propertyPath: m_LocalPosition.x
      value: 0
      objectReference: {fileID: 0}
    - target: {fileID: 2063248440274381664, guid: f9d7393e697e9644291f49eab437e7e5, type: 3}
      propertyPath: m_LocalPosition.y
      value: 0
      objectReference: {fileID: 0}
    - target: {fileID: 2063248440274381664, guid: f9d7393e697e9644291f49eab437e7e5, type: 3}
      propertyPath: m_LocalPosition.z
      value: 0
      objectReference: {fileID: 0}
    - target: {fileID: 2063248440274381664, guid: f9d7393e697e9644291f49eab437e7e5, type: 3}
      propertyPath: m_LocalRotation.w
      value: 1
      objectReference: {fileID: 0}
    - target: {fileID: 2063248440274381664, guid: f9d7393e697e9644291f49eab437e7e5, type: 3}
      propertyPath: m_LocalRotation.x
      value: 0
      objectReference: {fileID: 0}
    - target: {fileID: 2063248440274381664, guid: f9d7393e697e9644291f49eab437e7e5, type: 3}
      propertyPath: m_LocalRotation.y
      value: 0
      objectReference: {fileID: 0}
    - target: {fileID: 2063248440274381664, guid: f9d7393e697e9644291f49eab437e7e5, type: 3}
      propertyPath: m_LocalRotation.z
      value: 0
      objectReference: {fileID: 0}
    - target: {fileID: 2063248440274381664, guid: f9d7393e697e9644291f49eab437e7e5, type: 3}
      propertyPath: m_AnchoredPosition.x
      value: 0
      objectReference: {fileID: 0}
    - target: {fileID: 2063248440274381664, guid: f9d7393e697e9644291f49eab437e7e5, type: 3}
      propertyPath: m_AnchoredPosition.y
      value: 0
      objectReference: {fileID: 0}
    - target: {fileID: 2063248440274381664, guid: f9d7393e697e9644291f49eab437e7e5, type: 3}
      propertyPath: m_LocalEulerAnglesHint.x
      value: 0
      objectReference: {fileID: 0}
    - target: {fileID: 2063248440274381664, guid: f9d7393e697e9644291f49eab437e7e5, type: 3}
      propertyPath: m_LocalEulerAnglesHint.y
      value: 0
      objectReference: {fileID: 0}
    - target: {fileID: 2063248440274381664, guid: f9d7393e697e9644291f49eab437e7e5, type: 3}
      propertyPath: m_LocalEulerAnglesHint.z
      value: 0
      objectReference: {fileID: 0}
    m_RemovedComponents: []
  m_SourcePrefab: {fileID: 100100000, guid: f9d7393e697e9644291f49eab437e7e5, type: 3}
--- !u!224 &1359804415 stripped
RectTransform:
  m_CorrespondingSourceObject: {fileID: 2063248440274381664, guid: f9d7393e697e9644291f49eab437e7e5, type: 3}
  m_PrefabInstance: {fileID: 1234023281}
  m_PrefabAsset: {fileID: 0}
--- !u!114 &1359804416 stripped
MonoBehaviour:
  m_CorrespondingSourceObject: {fileID: 218852605449744293, guid: f9d7393e697e9644291f49eab437e7e5, type: 3}
  m_PrefabInstance: {fileID: 1234023281}
  m_PrefabAsset: {fileID: 0}
  m_GameObject: {fileID: 0}
  m_Enabled: 1
  m_EditorHideFlags: 0
  m_Script: {fileID: 11500000, guid: 094f9975aec14531a442aa2ba5aed136, type: 3}
  m_Name: 
  m_EditorClassIdentifier: 
--- !u!1001 &1528749548
PrefabInstance:
  m_ObjectHideFlags: 0
  serializedVersion: 2
  m_Modification:
    m_TransformParent: {fileID: 0}
    m_Modifications:
    - target: {fileID: 5837701972018760123, guid: d3b517fbf6430fa41a25ed66e650cb9e, type: 3}
      propertyPath: _itemByDefaultId
      value: 1
      objectReference: {fileID: 0}
    - target: {fileID: 6089985646107416115, guid: d3b517fbf6430fa41a25ed66e650cb9e, type: 3}
      propertyPath: m_RootOrder
      value: 9
      objectReference: {fileID: 0}
    - target: {fileID: 6089985646107416115, guid: d3b517fbf6430fa41a25ed66e650cb9e, type: 3}
      propertyPath: m_LocalPosition.x
      value: -1.8463763
      objectReference: {fileID: 0}
    - target: {fileID: 6089985646107416115, guid: d3b517fbf6430fa41a25ed66e650cb9e, type: 3}
      propertyPath: m_LocalPosition.y
      value: 1.6080797
      objectReference: {fileID: 0}
    - target: {fileID: 6089985646107416115, guid: d3b517fbf6430fa41a25ed66e650cb9e, type: 3}
      propertyPath: m_LocalPosition.z
      value: -2183.0117
      objectReference: {fileID: 0}
    - target: {fileID: 6089985646107416115, guid: d3b517fbf6430fa41a25ed66e650cb9e, type: 3}
      propertyPath: m_LocalRotation.w
      value: 1
      objectReference: {fileID: 0}
    - target: {fileID: 6089985646107416115, guid: d3b517fbf6430fa41a25ed66e650cb9e, type: 3}
      propertyPath: m_LocalRotation.x
      value: 0
      objectReference: {fileID: 0}
    - target: {fileID: 6089985646107416115, guid: d3b517fbf6430fa41a25ed66e650cb9e, type: 3}
      propertyPath: m_LocalRotation.y
      value: 0
      objectReference: {fileID: 0}
    - target: {fileID: 6089985646107416115, guid: d3b517fbf6430fa41a25ed66e650cb9e, type: 3}
      propertyPath: m_LocalRotation.z
      value: 0
      objectReference: {fileID: 0}
    - target: {fileID: 6089985646107416115, guid: d3b517fbf6430fa41a25ed66e650cb9e, type: 3}
      propertyPath: m_LocalEulerAnglesHint.x
      value: 0
      objectReference: {fileID: 0}
    - target: {fileID: 6089985646107416115, guid: d3b517fbf6430fa41a25ed66e650cb9e, type: 3}
      propertyPath: m_LocalEulerAnglesHint.y
      value: 0
      objectReference: {fileID: 0}
    - target: {fileID: 6089985646107416115, guid: d3b517fbf6430fa41a25ed66e650cb9e, type: 3}
      propertyPath: m_LocalEulerAnglesHint.z
      value: 0
      objectReference: {fileID: 0}
    - target: {fileID: 8110524749108470314, guid: d3b517fbf6430fa41a25ed66e650cb9e, type: 3}
      propertyPath: m_Name
      value: ItemManager
      objectReference: {fileID: 0}
    m_RemovedComponents: []
  m_SourcePrefab: {fileID: 100100000, guid: d3b517fbf6430fa41a25ed66e650cb9e, type: 3}
--- !u!1001 &1826367369
PrefabInstance:
  m_ObjectHideFlags: 0
  serializedVersion: 2
  m_Modification:
    m_TransformParent: {fileID: 855955691}
    m_Modifications:
    - target: {fileID: 3288123541430475688, guid: 2ff3ead1820d7884ea37923c00eb475f, type: 3}
      propertyPath: m_Name
      value: EndgameScreen
      objectReference: {fileID: 0}
    - target: {fileID: 4825622020594853168, guid: 2ff3ead1820d7884ea37923c00eb475f, type: 3}
      propertyPath: m_Pivot.x
      value: 0.5
      objectReference: {fileID: 0}
    - target: {fileID: 4825622020594853168, guid: 2ff3ead1820d7884ea37923c00eb475f, type: 3}
      propertyPath: m_Pivot.y
      value: 0.5
      objectReference: {fileID: 0}
    - target: {fileID: 4825622020594853168, guid: 2ff3ead1820d7884ea37923c00eb475f, type: 3}
      propertyPath: m_RootOrder
      value: 1
      objectReference: {fileID: 0}
    - target: {fileID: 4825622020594853168, guid: 2ff3ead1820d7884ea37923c00eb475f, type: 3}
      propertyPath: m_AnchorMax.x
      value: 0.5
      objectReference: {fileID: 0}
    - target: {fileID: 4825622020594853168, guid: 2ff3ead1820d7884ea37923c00eb475f, type: 3}
      propertyPath: m_AnchorMax.y
      value: 0.5
      objectReference: {fileID: 0}
    - target: {fileID: 4825622020594853168, guid: 2ff3ead1820d7884ea37923c00eb475f, type: 3}
      propertyPath: m_AnchorMin.x
      value: 0.5
      objectReference: {fileID: 0}
    - target: {fileID: 4825622020594853168, guid: 2ff3ead1820d7884ea37923c00eb475f, type: 3}
      propertyPath: m_AnchorMin.y
      value: 0.5
      objectReference: {fileID: 0}
    - target: {fileID: 4825622020594853168, guid: 2ff3ead1820d7884ea37923c00eb475f, type: 3}
      propertyPath: m_SizeDelta.x
      value: 1200
      objectReference: {fileID: 0}
    - target: {fileID: 4825622020594853168, guid: 2ff3ead1820d7884ea37923c00eb475f, type: 3}
      propertyPath: m_SizeDelta.y
      value: 800
      objectReference: {fileID: 0}
    - target: {fileID: 4825622020594853168, guid: 2ff3ead1820d7884ea37923c00eb475f, type: 3}
      propertyPath: m_LocalPosition.x
      value: 0
      objectReference: {fileID: 0}
    - target: {fileID: 4825622020594853168, guid: 2ff3ead1820d7884ea37923c00eb475f, type: 3}
      propertyPath: m_LocalPosition.y
      value: 0
      objectReference: {fileID: 0}
    - target: {fileID: 4825622020594853168, guid: 2ff3ead1820d7884ea37923c00eb475f, type: 3}
      propertyPath: m_LocalPosition.z
      value: 0
      objectReference: {fileID: 0}
    - target: {fileID: 4825622020594853168, guid: 2ff3ead1820d7884ea37923c00eb475f, type: 3}
      propertyPath: m_LocalRotation.w
      value: 1
      objectReference: {fileID: 0}
    - target: {fileID: 4825622020594853168, guid: 2ff3ead1820d7884ea37923c00eb475f, type: 3}
      propertyPath: m_LocalRotation.x
      value: 0
      objectReference: {fileID: 0}
    - target: {fileID: 4825622020594853168, guid: 2ff3ead1820d7884ea37923c00eb475f, type: 3}
      propertyPath: m_LocalRotation.y
      value: 0
      objectReference: {fileID: 0}
    - target: {fileID: 4825622020594853168, guid: 2ff3ead1820d7884ea37923c00eb475f, type: 3}
      propertyPath: m_LocalRotation.z
      value: 0
      objectReference: {fileID: 0}
    - target: {fileID: 4825622020594853168, guid: 2ff3ead1820d7884ea37923c00eb475f, type: 3}
      propertyPath: m_AnchoredPosition.x
      value: 0
      objectReference: {fileID: 0}
    - target: {fileID: 4825622020594853168, guid: 2ff3ead1820d7884ea37923c00eb475f, type: 3}
      propertyPath: m_AnchoredPosition.y
      value: 0
      objectReference: {fileID: 0}
    - target: {fileID: 4825622020594853168, guid: 2ff3ead1820d7884ea37923c00eb475f, type: 3}
      propertyPath: m_LocalEulerAnglesHint.x
      value: 0
      objectReference: {fileID: 0}
    - target: {fileID: 4825622020594853168, guid: 2ff3ead1820d7884ea37923c00eb475f, type: 3}
      propertyPath: m_LocalEulerAnglesHint.y
      value: 0
      objectReference: {fileID: 0}
    - target: {fileID: 4825622020594853168, guid: 2ff3ead1820d7884ea37923c00eb475f, type: 3}
      propertyPath: m_LocalEulerAnglesHint.z
      value: 0
      objectReference: {fileID: 0}
    m_RemovedComponents: []
  m_SourcePrefab: {fileID: 100100000, guid: 2ff3ead1820d7884ea37923c00eb475f, type: 3}
--- !u!1001 &1565811469282093426
PrefabInstance:
  m_ObjectHideFlags: 0
  serializedVersion: 2
  m_Modification:
    m_TransformParent: {fileID: 0}
    m_Modifications:
    - target: {fileID: 1565811469687210802, guid: 8af554fe70af1134cbc194251b5b7ffd, type: 3}
      propertyPath: m_RootOrder
      value: 4
      objectReference: {fileID: 0}
    - target: {fileID: 1565811469687210802, guid: 8af554fe70af1134cbc194251b5b7ffd, type: 3}
      propertyPath: m_LocalPosition.x
      value: 243.58214
      objectReference: {fileID: 0}
    - target: {fileID: 1565811469687210802, guid: 8af554fe70af1134cbc194251b5b7ffd, type: 3}
      propertyPath: m_LocalPosition.y
      value: 129.33978
      objectReference: {fileID: 0}
    - target: {fileID: 1565811469687210802, guid: 8af554fe70af1134cbc194251b5b7ffd, type: 3}
      propertyPath: m_LocalPosition.z
      value: -28.73146
      objectReference: {fileID: 0}
    - target: {fileID: 1565811469687210802, guid: 8af554fe70af1134cbc194251b5b7ffd, type: 3}
      propertyPath: m_LocalRotation.w
      value: 1
      objectReference: {fileID: 0}
    - target: {fileID: 1565811469687210802, guid: 8af554fe70af1134cbc194251b5b7ffd, type: 3}
      propertyPath: m_LocalRotation.x
      value: -0
      objectReference: {fileID: 0}
    - target: {fileID: 1565811469687210802, guid: 8af554fe70af1134cbc194251b5b7ffd, type: 3}
      propertyPath: m_LocalRotation.y
      value: -0
      objectReference: {fileID: 0}
    - target: {fileID: 1565811469687210802, guid: 8af554fe70af1134cbc194251b5b7ffd, type: 3}
      propertyPath: m_LocalRotation.z
      value: -0
      objectReference: {fileID: 0}
    - target: {fileID: 1565811469687210802, guid: 8af554fe70af1134cbc194251b5b7ffd, type: 3}
      propertyPath: m_LocalEulerAnglesHint.x
      value: 0
      objectReference: {fileID: 0}
    - target: {fileID: 1565811469687210802, guid: 8af554fe70af1134cbc194251b5b7ffd, type: 3}
      propertyPath: m_LocalEulerAnglesHint.y
      value: 0
      objectReference: {fileID: 0}
    - target: {fileID: 1565811469687210802, guid: 8af554fe70af1134cbc194251b5b7ffd, type: 3}
      propertyPath: m_LocalEulerAnglesHint.z
      value: 0
      objectReference: {fileID: 0}
    - target: {fileID: 1565811469687210828, guid: 8af554fe70af1134cbc194251b5b7ffd, type: 3}
      propertyPath: m_Name
      value: GameManager
      objectReference: {fileID: 0}
    m_RemovedComponents: []
  m_SourcePrefab: {fileID: 100100000, guid: 8af554fe70af1134cbc194251b5b7ffd, type: 3}
--- !u!1001 &2386794199862497127
PrefabInstance:
  m_ObjectHideFlags: 0
  serializedVersion: 2
  m_Modification:
    m_TransformParent: {fileID: 0}
    m_Modifications:
    - target: {fileID: 533092681880420829, guid: 65ac965853907ff4391b5dceb793bf2e, type: 3}
      propertyPath: m_Name
      value: SoundManager
      objectReference: {fileID: 0}
    - target: {fileID: 1360987026368348088, guid: 65ac965853907ff4391b5dceb793bf2e, type: 3}
      propertyPath: m_RootOrder
      value: 10
      objectReference: {fileID: 0}
    - target: {fileID: 1360987026368348088, guid: 65ac965853907ff4391b5dceb793bf2e, type: 3}
      propertyPath: m_LocalPosition.x
      value: 432.0034
      objectReference: {fileID: 0}
    - target: {fileID: 1360987026368348088, guid: 65ac965853907ff4391b5dceb793bf2e, type: 3}
      propertyPath: m_LocalPosition.y
      value: 843.3495
      objectReference: {fileID: 0}
    - target: {fileID: 1360987026368348088, guid: 65ac965853907ff4391b5dceb793bf2e, type: 3}
      propertyPath: m_LocalPosition.z
      value: -662.37195
      objectReference: {fileID: 0}
    - target: {fileID: 1360987026368348088, guid: 65ac965853907ff4391b5dceb793bf2e, type: 3}
      propertyPath: m_LocalRotation.w
      value: 1
      objectReference: {fileID: 0}
    - target: {fileID: 1360987026368348088, guid: 65ac965853907ff4391b5dceb793bf2e, type: 3}
      propertyPath: m_LocalRotation.x
      value: 0
      objectReference: {fileID: 0}
    - target: {fileID: 1360987026368348088, guid: 65ac965853907ff4391b5dceb793bf2e, type: 3}
      propertyPath: m_LocalRotation.y
      value: 0
      objectReference: {fileID: 0}
    - target: {fileID: 1360987026368348088, guid: 65ac965853907ff4391b5dceb793bf2e, type: 3}
      propertyPath: m_LocalRotation.z
      value: 0
      objectReference: {fileID: 0}
    - target: {fileID: 1360987026368348088, guid: 65ac965853907ff4391b5dceb793bf2e, type: 3}
      propertyPath: m_LocalEulerAnglesHint.x
      value: 0
      objectReference: {fileID: 0}
    - target: {fileID: 1360987026368348088, guid: 65ac965853907ff4391b5dceb793bf2e, type: 3}
      propertyPath: m_LocalEulerAnglesHint.y
      value: 0
      objectReference: {fileID: 0}
    - target: {fileID: 1360987026368348088, guid: 65ac965853907ff4391b5dceb793bf2e, type: 3}
      propertyPath: m_LocalEulerAnglesHint.z
      value: 0
      objectReference: {fileID: 0}
    - target: {fileID: 8229090541446067341, guid: 65ac965853907ff4391b5dceb793bf2e, type: 3}
      propertyPath: _sfxSounds.Array.size
      value: 5
      objectReference: {fileID: 0}
    - target: {fileID: 8229090541446067341, guid: 65ac965853907ff4391b5dceb793bf2e, type: 3}
      propertyPath: _musicSounds.Array.size
      value: 2
      objectReference: {fileID: 0}
    - target: {fileID: 8229090541446067341, guid: 65ac965853907ff4391b5dceb793bf2e, type: 3}
      propertyPath: _sfxSounds.Array.data[0]
      value: 
      objectReference: {fileID: 11400000, guid: 07b98c075a7496c498dbeca7eb282cb3, type: 2}
    - target: {fileID: 8229090541446067341, guid: 65ac965853907ff4391b5dceb793bf2e, type: 3}
      propertyPath: _sfxSounds.Array.data[1]
      value: 
      objectReference: {fileID: 11400000, guid: 81025eae0d26902488a11767a6671194, type: 2}
    - target: {fileID: 8229090541446067341, guid: 65ac965853907ff4391b5dceb793bf2e, type: 3}
      propertyPath: _sfxSounds.Array.data[2]
      value: 
      objectReference: {fileID: 11400000, guid: 6643601e678e2c04d916ba34d53207e7, type: 2}
    - target: {fileID: 8229090541446067341, guid: 65ac965853907ff4391b5dceb793bf2e, type: 3}
      propertyPath: _sfxSounds.Array.data[3]
      value: 
      objectReference: {fileID: 11400000, guid: 7565517ce59819443a600ed434a62166, type: 2}
    - target: {fileID: 8229090541446067341, guid: 65ac965853907ff4391b5dceb793bf2e, type: 3}
      propertyPath: _sfxSounds.Array.data[4]
      value: 
      objectReference: {fileID: 11400000, guid: 27412bad752a5204ab68d351adecb49e, type: 2}
    - target: {fileID: 8229090541446067341, guid: 65ac965853907ff4391b5dceb793bf2e, type: 3}
      propertyPath: _musicSounds.Array.data[0]
      value: 
      objectReference: {fileID: 11400000, guid: c20a8181edaf99e4dbc5b6b83e09c6d2, type: 2}
    - target: {fileID: 8229090541446067341, guid: 65ac965853907ff4391b5dceb793bf2e, type: 3}
      propertyPath: _musicSounds.Array.data[1]
      value: 
      objectReference: {fileID: 11400000, guid: b1ada298814976441b5e68edf1e41aeb, type: 2}
    m_RemovedComponents: []
  m_SourcePrefab: {fileID: 100100000, guid: 65ac965853907ff4391b5dceb793bf2e, type: 3}
--- !u!1001 &3007392275966865496
PrefabInstance:
  m_ObjectHideFlags: 0
  serializedVersion: 2
  m_Modification:
    m_TransformParent: {fileID: 0}
    m_Modifications:
    - target: {fileID: 1064425002023574946, guid: e67ae80fed8164a41bcbd5d5cd68018f, type: 3}
      propertyPath: m_Name
      value: InputManager
      objectReference: {fileID: 0}
    - target: {fileID: 6058904311856576288, guid: e67ae80fed8164a41bcbd5d5cd68018f, type: 3}
      propertyPath: m_RootOrder
      value: 8
      objectReference: {fileID: 0}
    - target: {fileID: 6058904311856576288, guid: e67ae80fed8164a41bcbd5d5cd68018f, type: 3}
      propertyPath: m_LocalPosition.x
      value: 5.49401
      objectReference: {fileID: 0}
    - target: {fileID: 6058904311856576288, guid: e67ae80fed8164a41bcbd5d5cd68018f, type: 3}
      propertyPath: m_LocalPosition.y
      value: -22.279396
      objectReference: {fileID: 0}
    - target: {fileID: 6058904311856576288, guid: e67ae80fed8164a41bcbd5d5cd68018f, type: 3}
      propertyPath: m_LocalPosition.z
      value: -2544.9006
      objectReference: {fileID: 0}
    - target: {fileID: 6058904311856576288, guid: e67ae80fed8164a41bcbd5d5cd68018f, type: 3}
      propertyPath: m_LocalRotation.w
      value: 1
      objectReference: {fileID: 0}
    - target: {fileID: 6058904311856576288, guid: e67ae80fed8164a41bcbd5d5cd68018f, type: 3}
      propertyPath: m_LocalRotation.x
      value: 0
      objectReference: {fileID: 0}
    - target: {fileID: 6058904311856576288, guid: e67ae80fed8164a41bcbd5d5cd68018f, type: 3}
      propertyPath: m_LocalRotation.y
      value: 0
      objectReference: {fileID: 0}
    - target: {fileID: 6058904311856576288, guid: e67ae80fed8164a41bcbd5d5cd68018f, type: 3}
      propertyPath: m_LocalRotation.z
      value: 0
      objectReference: {fileID: 0}
    - target: {fileID: 6058904311856576288, guid: e67ae80fed8164a41bcbd5d5cd68018f, type: 3}
      propertyPath: m_LocalEulerAnglesHint.x
      value: 0
      objectReference: {fileID: 0}
    - target: {fileID: 6058904311856576288, guid: e67ae80fed8164a41bcbd5d5cd68018f, type: 3}
      propertyPath: m_LocalEulerAnglesHint.y
      value: 0
      objectReference: {fileID: 0}
    - target: {fileID: 6058904311856576288, guid: e67ae80fed8164a41bcbd5d5cd68018f, type: 3}
      propertyPath: m_LocalEulerAnglesHint.z
      value: 0
      objectReference: {fileID: 0}
    m_RemovedComponents: []
  m_SourcePrefab: {fileID: 100100000, guid: e67ae80fed8164a41bcbd5d5cd68018f, type: 3}
--- !u!1001 &3043563592158249267
PrefabInstance:
  m_ObjectHideFlags: 0
  serializedVersion: 2
  m_Modification:
    m_TransformParent: {fileID: 855955691}
    m_Modifications:
    - target: {fileID: 1897764847258669551, guid: 141109997fc4f1e45b46cc6f223f9553, type: 3}
      propertyPath: m_Name
      value: ChangeNameScreen
      objectReference: {fileID: 0}
    - target: {fileID: 1897764847258669552, guid: 141109997fc4f1e45b46cc6f223f9553, type: 3}
      propertyPath: m_Pivot.x
      value: 0.5
      objectReference: {fileID: 0}
    - target: {fileID: 1897764847258669552, guid: 141109997fc4f1e45b46cc6f223f9553, type: 3}
      propertyPath: m_Pivot.y
      value: 0.5
      objectReference: {fileID: 0}
    - target: {fileID: 1897764847258669552, guid: 141109997fc4f1e45b46cc6f223f9553, type: 3}
      propertyPath: m_RootOrder
      value: 4
      objectReference: {fileID: 0}
    - target: {fileID: 1897764847258669552, guid: 141109997fc4f1e45b46cc6f223f9553, type: 3}
      propertyPath: m_AnchorMax.x
      value: 0.5
      objectReference: {fileID: 0}
    - target: {fileID: 1897764847258669552, guid: 141109997fc4f1e45b46cc6f223f9553, type: 3}
      propertyPath: m_AnchorMax.y
      value: 0.5
      objectReference: {fileID: 0}
    - target: {fileID: 1897764847258669552, guid: 141109997fc4f1e45b46cc6f223f9553, type: 3}
      propertyPath: m_AnchorMin.x
      value: 0.5
      objectReference: {fileID: 0}
    - target: {fileID: 1897764847258669552, guid: 141109997fc4f1e45b46cc6f223f9553, type: 3}
      propertyPath: m_AnchorMin.y
      value: 0.5
      objectReference: {fileID: 0}
    - target: {fileID: 1897764847258669552, guid: 141109997fc4f1e45b46cc6f223f9553, type: 3}
      propertyPath: m_SizeDelta.x
      value: 1200
      objectReference: {fileID: 0}
    - target: {fileID: 1897764847258669552, guid: 141109997fc4f1e45b46cc6f223f9553, type: 3}
      propertyPath: m_SizeDelta.y
      value: 800
      objectReference: {fileID: 0}
    - target: {fileID: 1897764847258669552, guid: 141109997fc4f1e45b46cc6f223f9553, type: 3}
      propertyPath: m_LocalPosition.x
      value: 0
      objectReference: {fileID: 0}
    - target: {fileID: 1897764847258669552, guid: 141109997fc4f1e45b46cc6f223f9553, type: 3}
      propertyPath: m_LocalPosition.y
      value: 0
      objectReference: {fileID: 0}
    - target: {fileID: 1897764847258669552, guid: 141109997fc4f1e45b46cc6f223f9553, type: 3}
      propertyPath: m_LocalPosition.z
      value: 0
      objectReference: {fileID: 0}
    - target: {fileID: 1897764847258669552, guid: 141109997fc4f1e45b46cc6f223f9553, type: 3}
      propertyPath: m_LocalRotation.w
      value: 1
      objectReference: {fileID: 0}
    - target: {fileID: 1897764847258669552, guid: 141109997fc4f1e45b46cc6f223f9553, type: 3}
      propertyPath: m_LocalRotation.x
      value: -0
      objectReference: {fileID: 0}
    - target: {fileID: 1897764847258669552, guid: 141109997fc4f1e45b46cc6f223f9553, type: 3}
      propertyPath: m_LocalRotation.y
      value: -0
      objectReference: {fileID: 0}
    - target: {fileID: 1897764847258669552, guid: 141109997fc4f1e45b46cc6f223f9553, type: 3}
      propertyPath: m_LocalRotation.z
      value: -0
      objectReference: {fileID: 0}
    - target: {fileID: 1897764847258669552, guid: 141109997fc4f1e45b46cc6f223f9553, type: 3}
      propertyPath: m_AnchoredPosition.x
      value: 4
      objectReference: {fileID: 0}
    - target: {fileID: 1897764847258669552, guid: 141109997fc4f1e45b46cc6f223f9553, type: 3}
      propertyPath: m_AnchoredPosition.y
      value: 0.000015259
      objectReference: {fileID: 0}
    - target: {fileID: 1897764847258669552, guid: 141109997fc4f1e45b46cc6f223f9553, type: 3}
      propertyPath: m_LocalEulerAnglesHint.x
      value: 0
      objectReference: {fileID: 0}
    - target: {fileID: 1897764847258669552, guid: 141109997fc4f1e45b46cc6f223f9553, type: 3}
      propertyPath: m_LocalEulerAnglesHint.y
      value: 0
      objectReference: {fileID: 0}
    - target: {fileID: 1897764847258669552, guid: 141109997fc4f1e45b46cc6f223f9553, type: 3}
      propertyPath: m_LocalEulerAnglesHint.z
      value: 0
      objectReference: {fileID: 0}
    m_RemovedComponents: []
  m_SourcePrefab: {fileID: 100100000, guid: 141109997fc4f1e45b46cc6f223f9553, type: 3}
--- !u!224 &3488847035152732355 stripped
RectTransform:
  m_CorrespondingSourceObject: {fileID: 1897764847258669552, guid: 141109997fc4f1e45b46cc6f223f9553, type: 3}
  m_PrefabInstance: {fileID: 3043563592158249267}
  m_PrefabAsset: {fileID: 0}
--- !u!1001 &3741378664107298223
PrefabInstance:
  m_ObjectHideFlags: 0
  serializedVersion: 2
  m_Modification:
    m_TransformParent: {fileID: 0}
    m_Modifications:
    - target: {fileID: 3741378665326745890, guid: 4182807e11c5017419d38f5ad757d040, type: 3}
      propertyPath: m_RootOrder
      value: 7
      objectReference: {fileID: 0}
    - target: {fileID: 3741378665326745890, guid: 4182807e11c5017419d38f5ad757d040, type: 3}
      propertyPath: m_LocalPosition.x
      value: 380.2232
      objectReference: {fileID: 0}
    - target: {fileID: 3741378665326745890, guid: 4182807e11c5017419d38f5ad757d040, type: 3}
      propertyPath: m_LocalPosition.y
      value: 213.43814
      objectReference: {fileID: 0}
    - target: {fileID: 3741378665326745890, guid: 4182807e11c5017419d38f5ad757d040, type: 3}
      propertyPath: m_LocalPosition.z
      value: -339.34534
      objectReference: {fileID: 0}
    - target: {fileID: 3741378665326745890, guid: 4182807e11c5017419d38f5ad757d040, type: 3}
      propertyPath: m_LocalRotation.w
      value: 1
      objectReference: {fileID: 0}
    - target: {fileID: 3741378665326745890, guid: 4182807e11c5017419d38f5ad757d040, type: 3}
      propertyPath: m_LocalRotation.x
      value: 0
      objectReference: {fileID: 0}
    - target: {fileID: 3741378665326745890, guid: 4182807e11c5017419d38f5ad757d040, type: 3}
      propertyPath: m_LocalRotation.y
      value: 0
      objectReference: {fileID: 0}
    - target: {fileID: 3741378665326745890, guid: 4182807e11c5017419d38f5ad757d040, type: 3}
      propertyPath: m_LocalRotation.z
      value: 0
      objectReference: {fileID: 0}
    - target: {fileID: 3741378665326745890, guid: 4182807e11c5017419d38f5ad757d040, type: 3}
      propertyPath: m_LocalEulerAnglesHint.x
      value: 0
      objectReference: {fileID: 0}
    - target: {fileID: 3741378665326745890, guid: 4182807e11c5017419d38f5ad757d040, type: 3}
      propertyPath: m_LocalEulerAnglesHint.y
      value: 0
      objectReference: {fileID: 0}
    - target: {fileID: 3741378665326745890, guid: 4182807e11c5017419d38f5ad757d040, type: 3}
      propertyPath: m_LocalEulerAnglesHint.z
      value: 0
      objectReference: {fileID: 0}
    - target: {fileID: 3741378665326745891, guid: 4182807e11c5017419d38f5ad757d040, type: 3}
      propertyPath: _defaultPlayerModel
      value: 
      objectReference: {fileID: 11400000, guid: c743ee1281a716c42926677922951075, type: 2}
    - target: {fileID: 3741378665326745892, guid: 4182807e11c5017419d38f5ad757d040, type: 3}
      propertyPath: m_Name
      value: UserManager
      objectReference: {fileID: 0}
    m_RemovedComponents: []
  m_SourcePrefab: {fileID: 100100000, guid: 4182807e11c5017419d38f5ad757d040, type: 3}
--- !u!1001 &6908300207862379922
PrefabInstance:
  m_ObjectHideFlags: 0
  serializedVersion: 2
  m_Modification:
    m_TransformParent: {fileID: 855955691}
    m_Modifications:
    - target: {fileID: 157309845878643904, guid: e06b36cd012c4539ac48c7186ef2c1da, type: 3}
      propertyPath: m_Name
      value: ShopScreen
      objectReference: {fileID: 0}
    - target: {fileID: 157309845878643904, guid: e06b36cd012c4539ac48c7186ef2c1da, type: 3}
      propertyPath: m_IsActive
      value: 0
      objectReference: {fileID: 0}
    - target: {fileID: 157309845878643905, guid: e06b36cd012c4539ac48c7186ef2c1da, type: 3}
      propertyPath: m_Pivot.x
      value: 0.5
      objectReference: {fileID: 0}
    - target: {fileID: 157309845878643905, guid: e06b36cd012c4539ac48c7186ef2c1da, type: 3}
      propertyPath: m_Pivot.y
      value: 0.5
      objectReference: {fileID: 0}
    - target: {fileID: 157309845878643905, guid: e06b36cd012c4539ac48c7186ef2c1da, type: 3}
      propertyPath: m_RootOrder
      value: 3
      objectReference: {fileID: 0}
    - target: {fileID: 157309845878643905, guid: e06b36cd012c4539ac48c7186ef2c1da, type: 3}
      propertyPath: m_AnchorMax.x
      value: 0.5
      objectReference: {fileID: 0}
    - target: {fileID: 157309845878643905, guid: e06b36cd012c4539ac48c7186ef2c1da, type: 3}
      propertyPath: m_AnchorMax.y
      value: 0.5
      objectReference: {fileID: 0}
    - target: {fileID: 157309845878643905, guid: e06b36cd012c4539ac48c7186ef2c1da, type: 3}
      propertyPath: m_AnchorMin.x
      value: 0.5
      objectReference: {fileID: 0}
    - target: {fileID: 157309845878643905, guid: e06b36cd012c4539ac48c7186ef2c1da, type: 3}
      propertyPath: m_AnchorMin.y
      value: 0.5
      objectReference: {fileID: 0}
    - target: {fileID: 157309845878643905, guid: e06b36cd012c4539ac48c7186ef2c1da, type: 3}
      propertyPath: m_SizeDelta.x
      value: 1052.7561
      objectReference: {fileID: 0}
    - target: {fileID: 157309845878643905, guid: e06b36cd012c4539ac48c7186ef2c1da, type: 3}
      propertyPath: m_SizeDelta.y
      value: 844.1494
      objectReference: {fileID: 0}
    - target: {fileID: 157309845878643905, guid: e06b36cd012c4539ac48c7186ef2c1da, type: 3}
      propertyPath: m_LocalPosition.x
      value: 0
      objectReference: {fileID: 0}
    - target: {fileID: 157309845878643905, guid: e06b36cd012c4539ac48c7186ef2c1da, type: 3}
      propertyPath: m_LocalPosition.y
      value: 0
      objectReference: {fileID: 0}
    - target: {fileID: 157309845878643905, guid: e06b36cd012c4539ac48c7186ef2c1da, type: 3}
      propertyPath: m_LocalPosition.z
      value: 0
      objectReference: {fileID: 0}
    - target: {fileID: 157309845878643905, guid: e06b36cd012c4539ac48c7186ef2c1da, type: 3}
      propertyPath: m_LocalRotation.w
      value: 1
      objectReference: {fileID: 0}
    - target: {fileID: 157309845878643905, guid: e06b36cd012c4539ac48c7186ef2c1da, type: 3}
      propertyPath: m_LocalRotation.x
      value: 0
      objectReference: {fileID: 0}
    - target: {fileID: 157309845878643905, guid: e06b36cd012c4539ac48c7186ef2c1da, type: 3}
      propertyPath: m_LocalRotation.y
      value: 0
      objectReference: {fileID: 0}
    - target: {fileID: 157309845878643905, guid: e06b36cd012c4539ac48c7186ef2c1da, type: 3}
      propertyPath: m_LocalRotation.z
      value: 0
      objectReference: {fileID: 0}
    - target: {fileID: 157309845878643905, guid: e06b36cd012c4539ac48c7186ef2c1da, type: 3}
      propertyPath: m_AnchoredPosition.x
      value: -0.000019073
      objectReference: {fileID: 0}
    - target: {fileID: 157309845878643905, guid: e06b36cd012c4539ac48c7186ef2c1da, type: 3}
      propertyPath: m_AnchoredPosition.y
      value: 0.000017166
      objectReference: {fileID: 0}
    - target: {fileID: 157309845878643905, guid: e06b36cd012c4539ac48c7186ef2c1da, type: 3}
      propertyPath: m_LocalEulerAnglesHint.x
      value: 0
      objectReference: {fileID: 0}
    - target: {fileID: 157309845878643905, guid: e06b36cd012c4539ac48c7186ef2c1da, type: 3}
      propertyPath: m_LocalEulerAnglesHint.y
      value: 0
      objectReference: {fileID: 0}
    - target: {fileID: 157309845878643905, guid: e06b36cd012c4539ac48c7186ef2c1da, type: 3}
      propertyPath: m_LocalEulerAnglesHint.z
      value: 0
      objectReference: {fileID: 0}
    m_RemovedComponents: []
  m_SourcePrefab: {fileID: 100100000, guid: e06b36cd012c4539ac48c7186ef2c1da, type: 3}
--- !u!1001 &7251431588623985077
PrefabInstance:
  m_ObjectHideFlags: 0
  serializedVersion: 2
  m_Modification:
    m_TransformParent: {fileID: 0}
    m_Modifications:
    - target: {fileID: 7251431587867895604, guid: a53a96fb9f888a845a74dfc004677a4b, type: 3}
      propertyPath: _screens.Array.size
      value: 7
      objectReference: {fileID: 0}
    - target: {fileID: 7251431587867895604, guid: a53a96fb9f888a845a74dfc004677a4b, type: 3}
      propertyPath: _screens.Array.data[0]
      value: 
      objectReference: {fileID: 1359804416}
    - target: {fileID: 7251431587867895604, guid: a53a96fb9f888a845a74dfc004677a4b, type: 3}
      propertyPath: _screens.Array.data[1]
      value: 
      objectReference: {fileID: 1110261507}
    - target: {fileID: 7251431587867895604, guid: a53a96fb9f888a845a74dfc004677a4b, type: 3}
      propertyPath: _screens.Array.data[2]
      value: 
      objectReference: {fileID: 1001782991}
    - target: {fileID: 7251431587867895604, guid: a53a96fb9f888a845a74dfc004677a4b, type: 3}
      propertyPath: _screens.Array.data[3]
      value: 
      objectReference: {fileID: 7341728914451394237}
    - target: {fileID: 7251431587867895604, guid: a53a96fb9f888a845a74dfc004677a4b, type: 3}
      propertyPath: _screens.Array.data[4]
      value: 
      objectReference: {fileID: 1089247957}
    - target: {fileID: 7251431587867895604, guid: a53a96fb9f888a845a74dfc004677a4b, type: 3}
      propertyPath: _screens.Array.data[5]
      value: 
      objectReference: {fileID: 950518408}
    - target: {fileID: 7251431587867895604, guid: a53a96fb9f888a845a74dfc004677a4b, type: 3}
      propertyPath: _screens.Array.data[6]
      value: 
      objectReference: {fileID: 1010885870}
    - target: {fileID: 7251431587867895605, guid: a53a96fb9f888a845a74dfc004677a4b, type: 3}
      propertyPath: m_Name
      value: UIManager
      objectReference: {fileID: 0}
    - target: {fileID: 7251431587867895607, guid: a53a96fb9f888a845a74dfc004677a4b, type: 3}
      propertyPath: m_RootOrder
      value: 5
      objectReference: {fileID: 0}
    - target: {fileID: 7251431587867895607, guid: a53a96fb9f888a845a74dfc004677a4b, type: 3}
      propertyPath: m_LocalPosition.x
      value: -0.90756536
      objectReference: {fileID: 0}
    - target: {fileID: 7251431587867895607, guid: a53a96fb9f888a845a74dfc004677a4b, type: 3}
      propertyPath: m_LocalPosition.y
      value: 0.7729434
      objectReference: {fileID: 0}
    - target: {fileID: 7251431587867895607, guid: a53a96fb9f888a845a74dfc004677a4b, type: 3}
      propertyPath: m_LocalPosition.z
      value: -2.3992465
      objectReference: {fileID: 0}
    - target: {fileID: 7251431587867895607, guid: a53a96fb9f888a845a74dfc004677a4b, type: 3}
      propertyPath: m_LocalRotation.w
      value: 1
      objectReference: {fileID: 0}
    - target: {fileID: 7251431587867895607, guid: a53a96fb9f888a845a74dfc004677a4b, type: 3}
      propertyPath: m_LocalRotation.x
      value: 0
      objectReference: {fileID: 0}
    - target: {fileID: 7251431587867895607, guid: a53a96fb9f888a845a74dfc004677a4b, type: 3}
      propertyPath: m_LocalRotation.y
      value: 0
      objectReference: {fileID: 0}
    - target: {fileID: 7251431587867895607, guid: a53a96fb9f888a845a74dfc004677a4b, type: 3}
      propertyPath: m_LocalRotation.z
      value: 0
      objectReference: {fileID: 0}
    - target: {fileID: 7251431587867895607, guid: a53a96fb9f888a845a74dfc004677a4b, type: 3}
      propertyPath: m_LocalEulerAnglesHint.x
      value: 0
      objectReference: {fileID: 0}
    - target: {fileID: 7251431587867895607, guid: a53a96fb9f888a845a74dfc004677a4b, type: 3}
      propertyPath: m_LocalEulerAnglesHint.y
      value: 0
      objectReference: {fileID: 0}
    - target: {fileID: 7251431587867895607, guid: a53a96fb9f888a845a74dfc004677a4b, type: 3}
      propertyPath: m_LocalEulerAnglesHint.z
      value: 0
      objectReference: {fileID: 0}
    m_RemovedComponents: []
  m_SourcePrefab: {fileID: 100100000, guid: a53a96fb9f888a845a74dfc004677a4b, type: 3}
--- !u!114 &7341728914451394237 stripped
MonoBehaviour:
  m_CorrespondingSourceObject: {fileID: 5755573362238779278, guid: 141109997fc4f1e45b46cc6f223f9553, type: 3}
  m_PrefabInstance: {fileID: 3043563592158249267}
  m_PrefabAsset: {fileID: 0}
  m_GameObject: {fileID: 0}
  m_Enabled: 1
  m_EditorHideFlags: 0
  m_Script: {fileID: 11500000, guid: 185755c170cd4b50a753178d892d0cc4, type: 3}
  m_Name: 
  m_EditorClassIdentifier: 
--- !u!1001 &7745349689704760459
PrefabInstance:
  m_ObjectHideFlags: 0
  serializedVersion: 2
  m_Modification:
    m_TransformParent: {fileID: 855955691}
    m_Modifications:
    - target: {fileID: 779724170521127976, guid: 2b4866d073ad732498fa34b2872b5f26, type: 3}
      propertyPath: m_Name
      value: GameHUD
      objectReference: {fileID: 0}
    - target: {fileID: 779724170521127976, guid: 2b4866d073ad732498fa34b2872b5f26, type: 3}
      propertyPath: m_IsActive
      value: 0
      objectReference: {fileID: 0}
    - target: {fileID: 7365519152782231152, guid: 2b4866d073ad732498fa34b2872b5f26, type: 3}
      propertyPath: m_Pivot.x
      value: 0.5
      objectReference: {fileID: 0}
    - target: {fileID: 7365519152782231152, guid: 2b4866d073ad732498fa34b2872b5f26, type: 3}
      propertyPath: m_Pivot.y
      value: 0.5
      objectReference: {fileID: 0}
    - target: {fileID: 7365519152782231152, guid: 2b4866d073ad732498fa34b2872b5f26, type: 3}
      propertyPath: m_RootOrder
      value: 2
      objectReference: {fileID: 0}
    - target: {fileID: 7365519152782231152, guid: 2b4866d073ad732498fa34b2872b5f26, type: 3}
      propertyPath: m_AnchorMax.x
      value: 1
      objectReference: {fileID: 0}
    - target: {fileID: 7365519152782231152, guid: 2b4866d073ad732498fa34b2872b5f26, type: 3}
      propertyPath: m_AnchorMax.y
      value: 1
      objectReference: {fileID: 0}
    - target: {fileID: 7365519152782231152, guid: 2b4866d073ad732498fa34b2872b5f26, type: 3}
      propertyPath: m_AnchorMin.x
      value: 0
      objectReference: {fileID: 0}
    - target: {fileID: 7365519152782231152, guid: 2b4866d073ad732498fa34b2872b5f26, type: 3}
      propertyPath: m_AnchorMin.y
      value: 0
      objectReference: {fileID: 0}
    - target: {fileID: 7365519152782231152, guid: 2b4866d073ad732498fa34b2872b5f26, type: 3}
      propertyPath: m_SizeDelta.x
      value: 0
      objectReference: {fileID: 0}
    - target: {fileID: 7365519152782231152, guid: 2b4866d073ad732498fa34b2872b5f26, type: 3}
      propertyPath: m_SizeDelta.y
      value: 0
      objectReference: {fileID: 0}
    - target: {fileID: 7365519152782231152, guid: 2b4866d073ad732498fa34b2872b5f26, type: 3}
      propertyPath: m_LocalPosition.x
      value: 0
      objectReference: {fileID: 0}
    - target: {fileID: 7365519152782231152, guid: 2b4866d073ad732498fa34b2872b5f26, type: 3}
      propertyPath: m_LocalPosition.y
      value: 0
      objectReference: {fileID: 0}
    - target: {fileID: 7365519152782231152, guid: 2b4866d073ad732498fa34b2872b5f26, type: 3}
      propertyPath: m_LocalPosition.z
      value: 0
      objectReference: {fileID: 0}
    - target: {fileID: 7365519152782231152, guid: 2b4866d073ad732498fa34b2872b5f26, type: 3}
      propertyPath: m_LocalRotation.w
      value: 1
      objectReference: {fileID: 0}
    - target: {fileID: 7365519152782231152, guid: 2b4866d073ad732498fa34b2872b5f26, type: 3}
      propertyPath: m_LocalRotation.x
      value: 0
      objectReference: {fileID: 0}
    - target: {fileID: 7365519152782231152, guid: 2b4866d073ad732498fa34b2872b5f26, type: 3}
      propertyPath: m_LocalRotation.y
      value: 0
      objectReference: {fileID: 0}
    - target: {fileID: 7365519152782231152, guid: 2b4866d073ad732498fa34b2872b5f26, type: 3}
      propertyPath: m_LocalRotation.z
      value: 0
      objectReference: {fileID: 0}
    - target: {fileID: 7365519152782231152, guid: 2b4866d073ad732498fa34b2872b5f26, type: 3}
      propertyPath: m_AnchoredPosition.x
      value: 0
      objectReference: {fileID: 0}
    - target: {fileID: 7365519152782231152, guid: 2b4866d073ad732498fa34b2872b5f26, type: 3}
      propertyPath: m_AnchoredPosition.y
      value: 0
      objectReference: {fileID: 0}
    - target: {fileID: 7365519152782231152, guid: 2b4866d073ad732498fa34b2872b5f26, type: 3}
      propertyPath: m_LocalEulerAnglesHint.x
      value: 0
      objectReference: {fileID: 0}
    - target: {fileID: 7365519152782231152, guid: 2b4866d073ad732498fa34b2872b5f26, type: 3}
      propertyPath: m_LocalEulerAnglesHint.y
      value: 0
      objectReference: {fileID: 0}
    - target: {fileID: 7365519152782231152, guid: 2b4866d073ad732498fa34b2872b5f26, type: 3}
      propertyPath: m_LocalEulerAnglesHint.z
      value: 0
      objectReference: {fileID: 0}
    m_RemovedComponents: []
  m_SourcePrefab: {fileID: 100100000, guid: 2b4866d073ad732498fa34b2872b5f26, type: 3}
