%YAML 1.1
%TAG !u! tag:unity3d.com,2011:
--- !u!1 &190822504467597166
GameObject:
  m_ObjectHideFlags: 0
  m_CorrespondingSourceObject: {fileID: 0}
  m_PrefabInstance: {fileID: 0}
  m_PrefabAsset: {fileID: 0}
  serializedVersion: 6
  m_Component:
  - component: {fileID: 4190687271402573245}
  - component: {fileID: 7870937711059697819}
  - component: {fileID: 1467720912598781239}
  - component: {fileID: 8994381223695406408}
  - component: {fileID: 8346576324177895625}
  m_Layer: 0
  m_Name: FighterShip
  m_TagString: Player
  m_Icon: {fileID: 0}
  m_NavMeshLayer: 0
  m_StaticEditorFlags: 0
  m_IsActive: 1
--- !u!4 &4190687271402573245
Transform:
  m_ObjectHideFlags: 0
  m_CorrespondingSourceObject: {fileID: 0}
  m_PrefabInstance: {fileID: 0}
  m_PrefabAsset: {fileID: 0}
  m_GameObject: {fileID: 190822504467597166}
  m_LocalRotation: {x: 0, y: 0, z: 0, w: 1}
  m_LocalPosition: {x: -1.1541952, y: 1.5376275, z: -2175.581}
  m_LocalScale: {x: 0.2, y: 0.2, z: 1}
  m_Children:
  - {fileID: 302620256606498466}
  m_Father: {fileID: 0}
  m_RootOrder: 0
  m_LocalEulerAnglesHint: {x: 0, y: 0, z: 0}
--- !u!212 &7870937711059697819
SpriteRenderer:
  m_ObjectHideFlags: 0
  m_CorrespondingSourceObject: {fileID: 0}
  m_PrefabInstance: {fileID: 0}
  m_PrefabAsset: {fileID: 0}
  m_GameObject: {fileID: 190822504467597166}
  m_Enabled: 1
  m_CastShadows: 0
  m_ReceiveShadows: 0
  m_DynamicOccludee: 1
  m_MotionVectors: 1
  m_LightProbeUsage: 1
  m_ReflectionProbeUsage: 1
  m_RayTracingMode: 0
  m_RayTraceProcedural: 0
  m_RenderingLayerMask: 1
  m_RendererPriority: 0
  m_Materials:
  - {fileID: 10754, guid: 0000000000000000f000000000000000, type: 0}
  m_StaticBatchInfo:
    firstSubMesh: 0
    subMeshCount: 0
  m_StaticBatchRoot: {fileID: 0}
  m_ProbeAnchor: {fileID: 0}
  m_LightProbeVolumeOverride: {fileID: 0}
  m_ScaleInLightmap: 1
  m_ReceiveGI: 1
  m_PreserveUVs: 0
  m_IgnoreNormalsForChartDetection: 0
  m_ImportantGI: 0
  m_StitchLightmapSeams: 1
  m_SelectedEditorRenderState: 0
  m_MinimumChartSize: 4
  m_AutoUVMaxDistance: 0.5
  m_AutoUVMaxAngle: 89
  m_LightmapParameters: {fileID: 0}
  m_SortingLayerID: 0
  m_SortingLayer: 0
  m_SortingOrder: 1
  m_Sprite: {fileID: 21300000, guid: 1705df94498b32041922c57a33345868, type: 3}
  m_Color: {r: 1, g: 1, b: 1, a: 1}
  m_FlipX: 0
  m_FlipY: 0
  m_DrawMode: 0
  m_Size: {x: 5, y: 5}
  m_AdaptiveModeThreshold: 0.5
  m_SpriteTileMode: 0
  m_WasSpriteAssigned: 1
  m_MaskInteraction: 0
  m_SpriteSortPoint: 0
--- !u!114 &1467720912598781239
MonoBehaviour:
  m_ObjectHideFlags: 0
  m_CorrespondingSourceObject: {fileID: 0}
  m_PrefabInstance: {fileID: 0}
  m_PrefabAsset: {fileID: 0}
  m_GameObject: {fileID: 190822504467597166}
  m_Enabled: 1
  m_EditorHideFlags: 0
  m_Script: {fileID: 11500000, guid: d1e73eabc20fd304ebb078470242061f, type: 3}
  m_Name: 
  m_EditorClassIdentifier: 
  _parameters: {fileID: 11400000, guid: 18af63ccc59509f42bd51487aafae889, type: 2}
  _splashObject: {fileID: 3657670083494563850}
  _bulletSpawnPositionY: 1.5
--- !u!60 &8994381223695406408
PolygonCollider2D:
  m_ObjectHideFlags: 0
  m_CorrespondingSourceObject: {fileID: 0}
  m_PrefabInstance: {fileID: 0}
  m_PrefabAsset: {fileID: 0}
  m_GameObject: {fileID: 190822504467597166}
  m_Enabled: 1
  m_Density: 1
  m_Material: {fileID: 0}
  m_IsTrigger: 0
  m_UsedByEffector: 0
  m_UsedByComposite: 0
  m_Offset: {x: 0, y: 0}
  m_SpriteTilingProperty:
    border: {x: 0, y: 0, z: 0, w: 0}
    pivot: {x: 0.5, y: 0.5}
    oldSize: {x: 5, y: 5}
    newSize: {x: 5, y: 5}
    adaptiveTilingThreshold: 0.5
    drawMode: 0
    adaptiveTiling: 0
  m_AutoTiling: 0
  m_Points:
    m_Paths:
    - - {x: 0.22, y: -1.24}
      - {x: 0.24, y: -1.22}
      - {x: 0.25, y: -1.16}
      - {x: 0.22999999, y: -1.12}
      - {x: 0.57, y: -1.3}
      - {x: 0.63, y: -1.3}
      - {x: 0.79999995, y: -1.24}
      - {x: 0.68, y: -0.78}
      - {x: 0.63, y: -0.69}
      - {x: 0.48999998, y: -0.58}
      - {x: 0.57, y: -0.58}
      - {x: 0.64, y: -0.44}
      - {x: 0.74, y: -0.37}
      - {x: 0.90999997, y: -0.19}
      - {x: 0.97999996, y: -0.08}
      - {x: 1.0799999, y: 0.13}
      - {x: 1.1, y: 0.21}
      - {x: 1.11, y: 0.32999998}
      - {x: 1.11, y: 0.68}
      - {x: 1.09, y: 0.75}
      - {x: 1.04, y: 0.95}
      - {x: 0.96999997, y: 1.06}
      - {x: 0.90999997, y: 1.14}
      - {x: 0.74, y: 1.1899999}
      - {x: 0.69, y: 1.1}
      - {x: 0.76, y: 0.90999997}
      - {x: 0.77, y: 0.81}
      - {x: 0.77, y: 0.59999996}
      - {x: 0.71999997, y: 0.29999998}
      - {x: 0.64, y: 0.38}
      - {x: 0.53999996, y: 0.38}
      - {x: 0.48999998, y: 0.32999998}
      - {x: 0.48999998, y: 0.19}
      - {x: 0.29999998, y: 0.48999998}
      - {x: 0.29999998, y: 0.7}
      - {x: 0.17999999, y: 0.89}
      - {x: 0.07, y: 0.97999996}
      - {x: 0.089999996, y: 1.05}
      - {x: 0.08, y: 1.15}
      - {x: 0.03, y: 1.27}
      - {x: 0, y: 1.3}
      - {x: -0.03, y: 1.29}
      - {x: -0.089999996, y: 1.0799999}
      - {x: -0.089999996, y: 0.96}
      - {x: -0.19, y: 0.88}
      - {x: -0.29999998, y: 0.7}
      - {x: -0.29999998, y: 0.48999998}
      - {x: -0.42999998, y: 0.28}
      - {x: -0.53999996, y: 0.38}
      - {x: -0.64, y: 0.38}
      - {x: -0.68, y: 0.34}
      - {x: -0.69, y: 0.28}
      - {x: -0.74, y: 0.44}
      - {x: -0.76, y: 0.61}
      - {x: -0.77, y: 0.81}
      - {x: -0.71, y: 1.13}
      - {x: -0.74, y: 1.17}
      - {x: -0.85999995, y: 1.16}
      - {x: -0.9, y: 1.13}
      - {x: -0.98999995, y: 1.03}
      - {x: -1.05, y: 0.89}
      - {x: -1.09, y: 0.75}
      - {x: -1.11, y: 0.65999997}
      - {x: -1.11, y: 0.26}
      - {x: -1.04, y: 0.02}
      - {x: -0.88, y: -0.24}
      - {x: -0.7, y: -0.41}
      - {x: -0.59, y: -0.45999998}
      - {x: -0.59, y: -0.55}
      - {x: -0.58, y: -0.58}
      - {x: -0.47, y: -0.57}
      - {x: -0.29999998, y: -0.52}
      - {x: -0.31, y: -0.56}
      - {x: -0.48999998, y: -0.58}
      - {x: -0.57, y: -0.62}
      - {x: -0.68, y: -0.78}
      - {x: -0.78999996, y: -1.24}
      - {x: -0.74, y: -1.26}
      - {x: -0.63, y: -1.29}
      - {x: -0.59999996, y: -1.3}
      - {x: -0.55, y: -1.3}
      - {x: -0.22999999, y: -1.11}
      - {x: -0.25, y: -1.23}
      - {x: -0.22, y: -1.24}
--- !u!50 &8346576324177895625
Rigidbody2D:
  serializedVersion: 4
  m_ObjectHideFlags: 0
  m_CorrespondingSourceObject: {fileID: 0}
  m_PrefabInstance: {fileID: 0}
  m_PrefabAsset: {fileID: 0}
  m_GameObject: {fileID: 190822504467597166}
  m_BodyType: 0
  m_Simulated: 1
  m_UseFullKinematicContacts: 0
  m_UseAutoMass: 0
  m_Mass: 1
  m_LinearDrag: 0
  m_AngularDrag: 0.05
  m_GravityScale: 0
  m_Material: {fileID: 0}
  m_Interpolate: 0
  m_SleepingMode: 1
  m_CollisionDetection: 0
  m_Constraints: 0
--- !u!1 &3657670083494563850
GameObject:
  m_ObjectHideFlags: 0
  m_CorrespondingSourceObject: {fileID: 0}
  m_PrefabInstance: {fileID: 0}
  m_PrefabAsset: {fileID: 0}
  serializedVersion: 6
  m_Component:
  - component: {fileID: 302620256606498466}
  - component: {fileID: 506386582571437827}
  m_Layer: 0
  m_Name: Splash
  m_TagString: Untagged
  m_Icon: {fileID: 0}
  m_NavMeshLayer: 0
  m_StaticEditorFlags: 0
  m_IsActive: 1
--- !u!4 &302620256606498466
Transform:
  m_ObjectHideFlags: 0
  m_CorrespondingSourceObject: {fileID: 0}
  m_PrefabInstance: {fileID: 0}
  m_PrefabAsset: {fileID: 0}
  m_GameObject: {fileID: 3657670083494563850}
  m_LocalRotation: {x: -0, y: -0, z: -0, w: 1}
  m_LocalPosition: {x: 0, y: -1.573, z: 0}
  m_LocalScale: {x: 1.1377347, y: 1.1377347, z: 1.1377347}
  m_Children: []
  m_Father: {fileID: 4190687271402573245}
  m_RootOrder: 0
  m_LocalEulerAnglesHint: {x: 0, y: 0, z: 0}
--- !u!212 &506386582571437827
SpriteRenderer:
  m_ObjectHideFlags: 0
  m_CorrespondingSourceObject: {fileID: 0}
  m_PrefabInstance: {fileID: 0}
  m_PrefabAsset: {fileID: 0}
  m_GameObject: {fileID: 3657670083494563850}
  m_Enabled: 1
  m_CastShadows: 0
  m_ReceiveShadows: 0
  m_DynamicOccludee: 1
  m_MotionVectors: 1
  m_LightProbeUsage: 1
  m_ReflectionProbeUsage: 1
  m_RayTracingMode: 0
  m_RayTraceProcedural: 0
  m_RenderingLayerMask: 1
  m_RendererPriority: 0
  m_Materials:
  - {fileID: 10754, guid: 0000000000000000f000000000000000, type: 0}
  m_StaticBatchInfo:
    firstSubMesh: 0
    subMeshCount: 0
  m_StaticBatchRoot: {fileID: 0}
  m_ProbeAnchor: {fileID: 0}
  m_LightProbeVolumeOverride: {fileID: 0}
  m_ScaleInLightmap: 1
  m_ReceiveGI: 1
  m_PreserveUVs: 0
  m_IgnoreNormalsForChartDetection: 0
  m_ImportantGI: 0
  m_StitchLightmapSeams: 1
  m_SelectedEditorRenderState: 0
  m_MinimumChartSize: 4
  m_AutoUVMaxDistance: 0.5
  m_AutoUVMaxAngle: 89
  m_LightmapParameters: {fileID: 0}
  m_SortingLayerID: 0
  m_SortingLayer: 0
  m_SortingOrder: 0
  m_Sprite: {fileID: 21300000, guid: 73cb2660dae2e4049a756fa3de1e751e, type: 3}
  m_Color: {r: 1, g: 1, b: 1, a: 1}
  m_FlipX: 0
  m_FlipY: 0
  m_DrawMode: 0
  m_Size: {x: 5, y: 5}
  m_AdaptiveModeThreshold: 0.5
  m_SpriteTileMode: 0
  m_WasSpriteAssigned: 1
  m_MaskInteraction: 0
  m_SpriteSortPoint: 0
