%YAML 1.1
%TAG !u! tag:unity3d.com,2011:
--- !u!114 &11400000
MonoBehaviour:
  m_ObjectHideFlags: 0
  m_CorrespondingSourceObject: {fileID: 0}
  m_PrefabInstance: {fileID: 0}
  m_PrefabAsset: {fileID: 0}
  m_GameObject: {fileID: 0}
  m_Enabled: 1
  m_EditorHideFlags: 0
  m_Script: {fileID: 11500000, guid: 6e52d93208eb4235a0c0edbaeba94a70, type: 3}
  m_Name: AlienParams
  m_EditorClassIdentifier: 
  _maxHp: 3
  _score: 15
  maxSpeed: 2
  rotateSpeed: 2.96
  shootCooldown: 1
  _accelerationSpeed: 0.5
  _slowdownSpeed: 1.5
  _minSpeed: 2
  damageOnCollisionMask:
    serializedVersion: 2
    m_Bits: 512
