^C:\USERS\BURDI\DESKTOP\SKOLA\ALG2\PROJEKT\PROJEKT\DEBUG\SOURCE.OBJ
C:\USERS\BURDI\DESKTOP\SKOLA\ALG2\PROJEKT\DEBUG\PROJEKT.ILK
C:\USERS\BURDI\DESKTOP\SKOLA\ALG2\PROJEKT\DEBUG\PROJEKT.EXE
C:\USERS\BURDI\DESKTOP\SKOLA\ALG2\PROJEKT\DEBUG\PROJEKT.PDB
