^C:\USERS\VLADIMIR\SOURCE\REPOS\FINAL\CLIENT\CLIENT.CPP
C:\USERS\VLADIMIR\SOURCE\REPOS\SERVER, MULTICLIENT\MULTICLIENT\DEBUG\VC142.PDB
C:\USERS\VLADIMIR\SOURCE\REPOS\SERVER, MULTICLIENT\MULTICLIENT\DEBUG\VC142.IDB
C:\USERS\VLADIMIR\SOURCE\REPOS\SERVER, MULTICLIENT\MULTICLIENT\DEBUG\CLIENT.OBJ
