^C:\USERS\VLADIMIR\SOURCE\REPOS\SERVER, MULTICLIENT\SERVER, MULTICLIENT\DEBUG\SERVER.OBJ
C:\USERS\VLADIMIR\SOURCE\REPOS\SERVER, MULTICLIENT\DEBUG\SERVER.ILK
C:\USERS\VLADIMIR\SOURCE\REPOS\SERVER, MULTICLIENT\DEBUG\SERVER.EXE
C:\USERS\VLADIMIR\SOURCE\REPOS\SERVER, MULTICLIENT\DEBUG\SERVER.PDB
