^C:\USERS\VLADIMIR\SOURCE\REPOS\FINAL\FINAL\SERVER.CPP
C:\USERS\VLADIMIR\SOURCE\REPOS\SERVER, MULTICLIENT\SERVER, MULTICLIENT\DEBUG\VC142.PDB
C:\USERS\VLADIMIR\SOURCE\REPOS\SERVER, MULTICLIENT\SERVER, MULTICLIENT\DEBUG\VC142.IDB
C:\USERS\VLADIMIR\SOURCE\REPOS\SERVER, MULTICLIENT\SERVER, MULTICLIENT\DEBUG\SERVER.OBJ
