<svg width="24" height="35" viewBox="0 0 24 35" fill="none" xmlns="http://www.w3.org/2000/svg">
<path d="M6.61735 25.485C7.61242 26.7529 8.51807 28.0885 9.32773 29.4822C9.94768 30.6892 10.445 31.9553 10.8121 33.2615C11.1226 34.1347 11.4031 34.3949 12.0046 34.3949C12.6608 34.3949 12.958 33.9522 13.1882 33.266C13.5483 31.9873 14.0318 30.7466 14.6321 29.5616C15.812 27.5555 17.1557 25.6503 18.6496 23.8656C20.156 22.0862 21.4883 20.1664 22.6283 18.1326C23.5385 16.2372 24.0074 14.1601 23.9998 12.0574C24.0122 10.106 23.548 8.18105 22.6477 6.44971" fill="#919EAB"/>
<path d="M1.18251 17.7108C0.384921 15.9281 -0.0182282 13.9942 0.00063251 12.0413C-0.0127535 9.20613 0.984784 6.459 2.8142 4.29297L8.46869 9.05135L1.18251 17.7108Z" fill="#919EAB"/>
<rect x="6.70822" y="4.85107" width="10.584" height="14.112" fill="#919EAB"/>
<path d="M1.1826 17.7088C2.46767 20.645 4.94609 23.2257 6.62276 25.4898L15.5301 14.9393C15.0938 15.4504 14.5525 15.8616 13.9431 16.1448C13.3338 16.428 12.6705 16.5767 11.9985 16.5807C11.3963 16.5835 10.7995 16.4671 10.2425 16.2381C9.68555 16.0091 9.17941 15.6721 8.75329 15.2466C8.32718 14.8211 7.98952 14.3154 7.75979 13.7587C7.53006 13.202 7.41281 12.6054 7.4148 12.0032C7.4299 10.9294 7.80057 9.89089 8.46878 9.05022M15.6288 0.542476C17.1315 1.01485 18.5258 1.78029 19.7309 2.79458C20.9361 3.80886 21.9284 5.05189 22.6504 6.45186L15.5327 14.934C16.1971 14.0869 16.5669 13.0461 16.5858 11.9696C16.5747 10.7604 16.0886 9.60401 15.2323 8.75007C14.3761 7.89613 13.2184 7.41312 12.0091 7.4053C11.3374 7.41444 10.6751 7.56511 10.0655 7.84748C9.45597 8.12985 8.91279 8.53757 8.47143 9.04405M2.8143 4.29097C3.93175 2.94596 5.33217 1.86404 6.91573 1.12234C8.49928 0.380647 10.227 -0.00255804 11.9756 4.75154e-05C13.2116 -0.00339912 14.441 0.180681 15.6218 0.546004L8.46526 9.04846" fill="#919EAB"/>
<mask id="mask0_2333_24447" style="mask-type:alpha" maskUnits="userSpaceOnUse" x="5" y="5" width="15" height="15">
<rect x="5" y="5" width="15" height="15" fill="#D9D9D9"/>
</mask>
<g mask="url(#mask0_2333_24447)">
<path d="M6.875 18.125V9.375H10.625V8.125L12.5 6.25L14.375 8.125V11.875H18.125V18.125H6.875ZM8.125 16.875H9.375V15.625H8.125V16.875ZM8.125 14.375H9.375V13.125H8.125V14.375ZM8.125 11.875H9.375V10.625H8.125V11.875ZM11.875 16.875H13.125V15.625H11.875V16.875ZM11.875 14.375H13.125V13.125H11.875V14.375ZM11.875 11.875H13.125V10.625H11.875V11.875ZM11.875 9.375H13.125V8.125H11.875V9.375ZM15.625 16.875H16.875V15.625H15.625V16.875ZM15.625 14.375H16.875V13.125H15.625V14.375Z" fill="white"/>
</g>
</svg>
