<svg width="24" height="35" viewBox="0 0 24 35" fill="none" xmlns="http://www.w3.org/2000/svg">
<path d="M6.61735 25.485C7.61242 26.7529 8.51807 28.0885 9.32773 29.4822C9.94768 30.6892 10.445 31.9553 10.8121 33.2615C11.1226 34.1347 11.4031 34.3949 12.0046 34.3949C12.6608 34.3949 12.958 33.9522 13.1882 33.266C13.5483 31.9873 14.0318 30.7466 14.6321 29.5616C15.812 27.5555 17.1557 25.6503 18.6496 23.8656C20.156 22.0862 21.4883 20.1664 22.6283 18.1326C23.5385 16.2372 24.0074 14.1601 23.9998 12.0574C24.0122 10.106 23.548 8.18105 22.6477 6.44971" fill="#4CAF50"/>
<path d="M1.18251 17.7108C0.384921 15.9281 -0.0182282 13.9942 0.00063251 12.0413C-0.0127535 9.20613 0.984784 6.459 2.8142 4.29297L8.46869 9.05135L1.18251 17.7108Z" fill="#4CAF50"/>
<rect x="6.70822" y="4.85107" width="10.584" height="14.112" fill="#4CAF50"/>
<path d="M1.1826 17.7088C2.46767 20.645 4.94609 23.2257 6.62276 25.4898L15.5301 14.9393C15.0938 15.4504 14.5525 15.8616 13.9431 16.1448C13.3338 16.428 12.6705 16.5767 11.9985 16.5807C11.3963 16.5835 10.7995 16.4671 10.2425 16.2381C9.68555 16.0091 9.17941 15.6721 8.75329 15.2466C8.32718 14.8211 7.98952 14.3154 7.75979 13.7587C7.53006 13.202 7.41281 12.6054 7.4148 12.0032C7.4299 10.9294 7.80057 9.89089 8.46878 9.05022M15.6288 0.542476C17.1315 1.01485 18.5258 1.78029 19.7309 2.79457C20.9361 3.80886 21.9284 5.05189 22.6504 6.45186L15.5327 14.934C16.1971 14.0869 16.5669 13.0461 16.5858 11.9696C16.5747 10.7604 16.0886 9.60401 15.2323 8.75007C14.3761 7.89613 13.2184 7.41312 12.0091 7.4053C11.3374 7.41444 10.6751 7.56511 10.0655 7.84748C9.45597 8.12985 8.91279 8.53757 8.47143 9.04405M2.8143 4.29097C3.93175 2.94596 5.33217 1.86404 6.91573 1.12234C8.49928 0.380647 10.227 -0.00255804 11.9756 4.75154e-05C13.2116 -0.00339912 14.441 0.180681 15.6218 0.546004L8.46526 9.04846" fill="#4CAF50"/>
<path d="M5 17V12.7143C5 12.3929 5.06875 12.1012 5.20625 11.8393C5.34375 11.5774 5.525 11.3452 5.75 11.1429V9.14286C5.75 8.54762 5.96875 8.04167 6.40625 7.625C6.84375 7.20833 7.375 7 8 7H11C11.2875 7 11.5563 7.05071 11.8063 7.15214C12.0563 7.2531 12.2875 7.39286 12.5 7.57143C12.7125 7.39286 12.9438 7.2531 13.1938 7.15214C13.4438 7.05071 13.7125 7 14 7H17C17.625 7 18.1562 7.20833 18.5938 7.625C19.0312 8.04167 19.25 8.54762 19.25 9.14286V11.1429C19.475 11.3452 19.6563 11.5774 19.7938 11.8393C19.9313 12.1012 20 12.3929 20 12.7143V17H18.5V15.5714H6.5V17H5ZM13.25 10.5714H17.75V9.14286C17.75 8.94048 17.678 8.77071 17.534 8.63357C17.3905 8.4969 17.2125 8.42857 17 8.42857H14C13.7875 8.42857 13.6095 8.4969 13.466 8.63357C13.322 8.77071 13.25 8.94048 13.25 9.14286V10.5714ZM7.25 10.5714H11.75V9.14286C11.75 8.94048 11.6783 8.77071 11.5348 8.63357C11.3908 8.4969 11.2125 8.42857 11 8.42857H8C7.7875 8.42857 7.60925 8.4969 7.46525 8.63357C7.32175 8.77071 7.25 8.94048 7.25 9.14286V10.5714ZM6.5 14.1429H18.5V12.7143C18.5 12.5119 18.428 12.3421 18.284 12.205C18.1405 12.0683 17.9625 12 17.75 12H7.25C7.0375 12 6.85925 12.0683 6.71525 12.205C6.57175 12.3421 6.5 12.5119 6.5 12.7143V14.1429Z" fill="white"/>
</svg>
