<svg width="24" height="35" viewBox="0 0 24 35" fill="none" xmlns="http://www.w3.org/2000/svg">
<path d="M6.61735 25.485C7.61242 26.7529 8.51807 28.0885 9.32773 29.4822C9.94768 30.6892 10.445 31.9553 10.8121 33.2615C11.1226 34.1347 11.4031 34.3949 12.0046 34.3949C12.6608 34.3949 12.958 33.9522 13.1882 33.266C13.5482 31.9873 14.0318 30.7466 14.6321 29.5616C15.812 27.5555 17.1557 25.6503 18.6496 23.8656C20.156 22.0862 21.4883 20.1664 22.6282 18.1326C23.5385 16.2372 24.0074 14.1601 23.9998 12.0574C24.0122 10.106 23.548 8.18105 22.6477 6.44971" fill="#FF4842"/>
<path d="M1.18251 17.7108C0.384921 15.9281 -0.0182282 13.9942 0.00063251 12.0413C-0.0127535 9.20613 0.984784 6.459 2.8142 4.29297L8.46869 9.05135L1.18251 17.7108Z" fill="#FF4842"/>
<rect x="6.70822" y="4.85107" width="10.584" height="14.112" fill="#FF4842"/>
<path d="M1.1826 17.7088C2.46767 20.645 4.94609 23.2257 6.62276 25.4898L15.5301 14.9393C15.0938 15.4504 14.5525 15.8616 13.9431 16.1448C13.3338 16.428 12.6705 16.5767 11.9985 16.5807C11.3963 16.5835 10.7995 16.4671 10.2425 16.2381C9.68555 16.0091 9.17941 15.6721 8.75329 15.2466C8.32718 14.8211 7.98952 14.3154 7.75979 13.7587C7.53006 13.202 7.41281 12.6054 7.4148 12.0032C7.4299 10.9294 7.80057 9.89089 8.46878 9.05022M15.6288 0.542476C17.1315 1.01485 18.5258 1.78029 19.7309 2.79458C20.9361 3.80886 21.9284 5.05189 22.6504 6.45186L15.5327 14.934C16.1971 14.0869 16.5669 13.0461 16.5858 11.9696C16.5747 10.7604 16.0886 9.60401 15.2323 8.75007C14.3761 7.89613 13.2184 7.41312 12.0091 7.4053C11.3374 7.41444 10.6751 7.56511 10.0655 7.84748C9.45597 8.12985 8.91279 8.53757 8.47143 9.04405M2.8143 4.29097C3.93175 2.94596 5.33217 1.86404 6.91573 1.12234C8.49928 0.380647 10.227 -0.00255804 11.9756 4.75154e-05C13.2116 -0.00339912 14.441 0.180681 15.6218 0.546004L8.46526 9.04846" fill="#FF4842"/>
<mask id="mask0_2345_24432" style="mask-type:alpha" maskUnits="userSpaceOnUse" x="5" y="4" width="15" height="15">
<rect x="5" y="4" width="15" height="15" fill="#D9D9D9"/>
</mask>
<g mask="url(#mask0_2345_24432)">
<path d="M10.0156 15.25H11.8906V14.625H10.6406V14H11.8906V12.125H10.0156V12.75H11.2656V13.375H10.0156V15.25ZM14.3906 15.25H15.0156V12.125H14.3906V13.375H13.7656V12.125H13.1406V14H14.3906V15.25ZM18.1406 10.9063V15.875C18.1406 16.2188 18.0183 16.5131 17.7738 16.7581C17.5288 17.0027 17.2344 17.125 16.8906 17.125H8.14063C7.79688 17.125 7.50271 17.0027 7.25813 16.7581C7.01313 16.5131 6.89063 16.2188 6.89063 15.875V10.9063C6.65104 10.6875 6.46625 10.4062 6.33625 10.0625C6.20584 9.71875 6.20313 9.34375 6.32813 8.9375L6.98438 6.8125C7.06771 6.54167 7.21625 6.31771 7.43 6.14062C7.64334 5.96354 7.89063 5.875 8.17188 5.875H16.8594C17.1406 5.875 17.3854 5.96083 17.5938 6.1325C17.8021 6.30458 17.9531 6.53125 18.0469 6.8125L18.7031 8.9375C18.8281 9.34375 18.8256 9.71354 18.6956 10.0469C18.5652 10.3802 18.3802 10.6667 18.1406 10.9063ZM13.8906 10.25C14.1719 10.25 14.3854 10.1535 14.5313 9.96062C14.6771 9.76812 14.7344 9.55208 14.7031 9.3125L14.3594 7.125H13.1406V9.4375C13.1406 9.65625 13.2135 9.84646 13.3594 10.0081C13.5052 10.1694 13.6823 10.25 13.8906 10.25ZM11.0781 10.25C11.3177 10.25 11.5131 10.1694 11.6644 10.0081C11.8152 9.84646 11.8906 9.65625 11.8906 9.4375V7.125H10.6719L10.3281 9.3125C10.2865 9.5625 10.3413 9.78125 10.4925 9.96875C10.6433 10.1563 10.8385 10.25 11.0781 10.25ZM8.29688 10.25C8.48438 10.25 8.64834 10.1823 8.78875 10.0469C8.92959 9.91146 9.01563 9.73958 9.04688 9.53125L9.39063 7.125H8.17188L7.54688 9.21875C7.48438 9.42708 7.51813 9.65104 7.64813 9.89063C7.77854 10.1302 7.99479 10.25 8.29688 10.25ZM16.7344 10.25C17.0365 10.25 17.2552 10.1302 17.3906 9.89063C17.526 9.65104 17.5573 9.42708 17.4844 9.21875L16.8281 7.125H15.6406L15.9844 9.53125C16.0156 9.73958 16.1017 9.91146 16.2425 10.0469C16.3829 10.1823 16.5469 10.25 16.7344 10.25ZM8.14063 15.875H16.8906V11.4687C16.8385 11.4896 16.8048 11.5 16.7894 11.5H16.7344C16.4531 11.5 16.2056 11.4531 15.9919 11.3594C15.7785 11.2656 15.5677 11.1146 15.3594 10.9063C15.1719 11.0938 14.9583 11.2396 14.7188 11.3438C14.4792 11.4479 14.224 11.5 13.9531 11.5C13.6719 11.5 13.4088 11.4479 13.1638 11.3438C12.9192 11.2396 12.7031 11.0938 12.5156 10.9063C12.3385 11.0938 12.1329 11.2396 11.8988 11.3438C11.6642 11.4479 11.4115 11.5 11.1406 11.5C10.8385 11.5 10.565 11.4479 10.32 11.3438C10.0754 11.2396 9.85938 11.0938 9.67188 10.9063C9.45313 11.125 9.23709 11.2785 9.02375 11.3669C8.81 11.4556 8.56771 11.5 8.29688 11.5H8.22688C8.20063 11.5 8.17188 11.4896 8.14063 11.4687V15.875Z" fill="white"/>
</g>
</svg>
